program: Gaussian 09
title: 000249995
version: EM64L-G09RevD.01
frameworkgroup: C1[X(C14H11NO5)]
method: RPBEPBE
basis: SDD
operation: Freq
keyword: #p
keyword: freq=noraman
keyword: PBEPBE/SDD
title: #p freq=noraman PBEPBE/SDD
converged: YES YES NO NO
title: Mulliken charges:
elementType: O O O O O N C C C C C C C C C C C C C C H H H H H H H H H H H
charge: -0.343899 -0.376884 -0.463390 -0.263691 -0.213396 -0.465169 0.538755 0.197248 -0.557552 -0.326928 0.144452 -0.373727 0.386891 0.240611 0.106679 -0.316545 -0.403672 -0.209930 -0.195307 -0.249245 0.283757 0.304396 0.224043 0.341050 0.302382 0.253356 0.229332 0.231362 0.230896 0.359360 0.384767
chargesum: 0.00000
title: Mulliken charges with hydrogens summed into heavy atoms:
elementType: O O O O O N C C C C C C C C C C C C C C
charge: -0.343899 -0.017524 -0.078623 -0.263691 -0.213396 -0.124119 0.538755 0.197248 -0.273795 -0.022532 0.144452 -0.149684 0.386891 0.240611 0.106679 -0.014163 -0.150316 0.019401 0.036055 -0.018349
polarizability: 3.20716230e+02 -1.55633163e+00 1.89406894e+02 -7.46432107e-02 -5.10122746e-02 6.76449525e+01
1716.lowfreq: -7.4012 -3.8899 -0.0007 0.0005 0.0011 1.6803 9.5112 25.5099 37.7138
frequency: 6.1818 25.4859 37.7112 54.6651 56.1625 76.1556 127.6926 142.8186 188.8569 198.5606 228.5523 238.4720 297.5149 335.2921 366.4381 370.6029 390.1159 393.8687 408.9026 422.8331 480.7882 497.1103 512.9065 544.7701 590.6454 605.9109 610.8443 614.2731 645.3121 686.1708 693.6730 694.5878 698.9509 721.7420 762.8830 764.4185 769.6393 823.8390 831.4491 841.0652 893.4032 919.7636 923.3176 970.9416 973.7916 974.8941 985.0926 991.7026 993.5598 1025.9326 1081.4892 1089.9080 1145.6894 1156.2625 1162.5479 1170.9705 1174.7902 1196.2220 1254.3781 1264.1850 1296.4249 1311.9323 1321.9647 1378.2591 1384.5741 1413.6597 1443.4481 1470.7221 1502.6447 1519.2413 1593.0696 1599.7018 1609.5001 1626.4035 1659.9602 1671.5198 3120.8652 3133.0411 3143.6301 3160.0868 3161.3375 3173.2054 3191.2332 3209.5831 3536.0946 3546.5447 3551.0914
redmass: 4.1455 7.0697 10.9812 10.0542 6.5013 7.1570 4.9941 7.0000 5.4471 6.9360 7.4884 5.5829 8.2766 7.4064 7.1313 5.0268 9.0582 1.1477 2.9491 3.0603 7.3060 3.0596 4.9035 2.2420 1.4162 6.3491 7.1772 5.6657 1.6982 3.3097 2.7343 7.7566 3.1051 7.3326 1.5089 4.2974 6.4400 1.5063 6.8412 1.2525 6.7383 1.4029 1.5751 1.3135 7.0467 1.3574 4.9439 5.2058 1.3003 2.0329 1.5130 1.9750 1.5414 2.9541 1.7725 1.0829 1.1694 1.7054 2.0188 2.0453 2.0886 1.3281 2.2462 4.0140 8.9338 6.0564 2.2927 2.2183 3.2400 2.0391 6.4723 6.1929 6.3255 6.6486 8.6439 9.1838 1.0908 1.0854 1.0902 1.0948 1.0919 1.1000 1.0946 1.0944 1.0642 1.0762 1.0659
irintensity: 0.0013 0.0003 1.8521 5.2037 0.3545 0.7020 1.6491 1.7264 6.7539 5.8621 11.5178 0.5833 0.3627 5.7949 0.8514 0.7420 4.9582 128.9137 0.0211 3.3288 16.8037 7.3816 34.1751 0.1813 195.6755 6.8511 16.8224 23.9402 16.2950 3.1163 15.6628 6.4995 100.5321 3.0647 93.4465 5.4309 49.1857 56.2801 5.1778 0.0501 32.4972 5.8209 39.2107 1.2607 235.6867 0.2566 81.9037 76.5257 1.9883 51.7285 16.3496 334.6246 116.1327 862.8572 33.2854 0.9377 24.1565 284.0608 11.6489 36.2966 101.7255 7.5730 81.5794 66.1113 28.5579 14.9308 9.1434 376.4863 478.7181 203.8132 28.0240 19.7500 28.2103 99.8780 301.3827 222.0316 15.5597 0.4684 15.7750 28.9683 6.2377 13.2063 6.4904 5.6263 43.3791 36.1963 47.7146
temp: 298.150 k
press: 1.00000 atm
elementType: 8 8 8 8 8 7 6 6 6 6 6 6 6 6 6 6 6 6 6 6 1 1 1 1 1 1 1 1 1 1 1
symmnumber: 1
zpe: 591173.2 jmol-1
zpe.correction: 0.225166 hartree
zpe.thermalcorrener: 0.242705 hartree
zpe.thermalcorrenthalpy: 0.243649 hartree
zpe.thermalcorrgfe: 0.175854 hartree
zpe.sumelectzpe: -969.566809 hartree
zpe.sumelectthermal: -969.549270 hartree
zpe.sumelectthermalent: -969.548326 hartree
zpe.sumelectthermalfe: -969.616121 hartree
dipole: -2.2545 0.2594 0.0022
dipole: 2.2694
quadrupole: -122.0777 -92.6413 -120.1018
quadrupole: -9.1310 0.0166 -0.0155
quadrupole: -10.4708 18.9657 -8.4949 -9.1310 0.0166 -0.0155
hfenergy: -969.7919753 hartree
pointgroup: C01 [X(C14H11N1O5)]
dipole: -0.8868646 -0.0951495 0.0400311 debye
polarizability: 320.7096547|1.8942333|168.1488621|-0.0025216|-46.2264181|88.9095597 unknown
InChI: InChI=1S/C14H11NO5/c16-12-7-6-9(8-11(12)13(17)18)15-14(19)20-10-4-2-1-3-5-10/h1-8,15-17H
charge 0 multiplicity 1
31 atoms
O  -2.281855 -0.551928 0.301587
O  5.248735 1.496404 -0.625487
O  4.269601 -2.311097 1.117649
O  -1.427285 1.472553 -0.632267
O  6.013635 -0.917418 0.491977
N  -0.065718 -0.28153 0.183054
C  1.247949 0.215417 -0.043122
C  3.679346 -0.197903 0.151446
C  2.332223 -0.603688 0.335844
C  1.507709 1.48483 -0.626802
C  3.931554 1.079362 -0.435834
C  2.836716 1.897086 -0.814197
C  -3.681659 -0.300929 0.178162
C  -1.262861 0.344859 -0.110159
C  4.779471 -1.10429 0.570436
C  -4.261829 0.869265 -0.36382
C  -4.478536 -1.362774 0.662837
C  -5.673102 0.954924 -0.41119
C  -5.883314 -1.255664 0.605634
C  -6.488153 -0.094761 0.067622
H  2.160379 -1.585503 0.787423
H  0.676054 2.126628 -0.923598
H  3.030355 2.878803 -1.265666
H  -0.152791 -1.20653 0.609373
H  -3.634273 1.680267 -0.733987
H  -3.98952 -2.250745 1.07455
H  -6.132316 1.857456 -0.829421
H  -6.502251 -2.077782 0.980779
H  -7.579118 -0.011358 0.0232
H  5.268981 2.396634 -1.03995
H  5.045973 -2.87449 1.379125
