program: Gaussian 09
title: 000249985
version: EM64L-G09RevD.01
frameworkgroup: C1[X(C11H7Cl3S)]
method: RPBEPBE
basis: SDD
operation: Freq
keyword: #p
keyword: freq=noraman
keyword: PBEPBE/SDD
title: #p freq=noraman PBEPBE/SDD
converged: YES YES NO NO
title: Mulliken charges:
elementType: Cl Cl Cl S C C C C C C C C C C C H H H H H H H
charge: 0.110944 0.109016 0.107838 0.385469 0.374594 0.389465 -0.365956 -0.396278 -0.273071 -0.405777 -0.402608 -0.211484 -0.237337 -0.232099 -0.682268 0.268979 0.243838 0.244519 0.242643 0.262688 0.233944 0.232940
chargesum: 0.00000
title: Mulliken charges with hydrogens summed into heavy atoms:
elementType: Cl Cl Cl S C C C C C C C C C C C
charge: 0.110944 0.109016 0.107838 0.385469 0.374594 0.389465 -0.096977 -0.152440 -0.273071 -0.161257 -0.159965 0.051203 -0.003393 0.000841 -0.682268
polarizability: 2.66278766e+02 -1.20363837e+01 1.56762969e+02 -2.50145538e+01 -5.68827864e+00 9.84589025e+01
1716.lowfreq: -9.7956 -0.0005 0.0013 0.0018 2.4221 3.8059 18.9189 38.0340 49.1898
frequency: 18.6068 37.9940 49.1784 116.5153 156.2792 172.0737 185.1452 225.2547 252.4224 261.9520 285.8747 314.7163 377.6153 389.7085 400.4542 410.7060 480.4553 510.0684 516.9403 590.5254 632.0069 634.7739 641.5252 678.4716 695.2543 757.3368 759.6647 780.9681 831.0922 832.3565 878.3764 920.4818 929.7407 964.8765 980.7182 997.6731 1023.0009 1069.9117 1130.3116 1156.9875 1175.4170 1225.2300 1245.0592 1274.2259 1339.5354 1405.2330 1423.0612 1428.8414 1447.0638 1505.9904 1577.3416 1586.8270 1632.5795 3125.5511 3131.0731 3134.3351 3147.3271 3150.4481 3165.8741 3171.0718
redmass: 8.9830 11.2430 7.0801 6.9378 11.0734 16.4600 3.7470 15.0185 7.7292 18.3577 23.9524 13.2432 6.4618 6.8501 5.3990 5.1389 2.5069 6.8077 3.9268 7.4138 6.8854 10.3468 3.9117 8.2755 12.0492 4.3908 1.3099 2.6719 2.6267 1.9035 1.4748 1.6063 5.3249 1.3580 1.3981 1.3521 2.3442 2.4116 1.6911 1.2277 1.0770 2.0019 1.4285 1.7907 1.8377 5.5496 2.8283 4.1200 2.2761 3.5724 7.3906 5.7182 6.6926 1.0859 1.0893 1.0892 1.0952 1.0926 1.1005 1.0962
irintensity: 0.0953 0.1618 0.1715 0.8585 0.2474 0.2995 1.3067 0.0854 1.3750 0.0581 0.4509 1.0766 6.4657 5.3430 4.2921 3.6874 27.3515 0.1019 8.8949 1.4321 14.4414 149.7912 33.4127 107.5009 173.8966 2.6988 35.3251 1.3745 16.1176 36.6843 31.4554 9.9045 3.4192 2.4088 5.7761 0.0642 4.8207 7.4855 12.2075 2.0408 0.6644 6.2497 1.1421 8.1085 4.7594 7.1566 1.2386 0.7032 0.1985 11.8712 0.1395 5.0307 3.6307 1.9919 0.3836 7.0673 25.6377 2.8075 33.6005 3.9034
temp: 298.150 k
press: 1.00000 atm
elementType: 17 17 17 16 6 6 6 6 6 6 6 6 6 6 6 1 1 1 1 1 1 1
symmnumber: 1
zpe: 378857.9 jmol-1
zpe.correction: 0.144299 hartree
zpe.thermalcorrener: 0.158221 hartree
zpe.thermalcorrenthalpy: 0.159165 hartree
zpe.thermalcorrgfe: 0.101044 hartree
zpe.sumelectzpe: -2200.545938 hartree
zpe.sumelectthermal: -2200.532016 hartree
zpe.sumelectthermalent: -2200.531072 hartree
zpe.sumelectthermalfe: -2200.589194 hartree
dipole: 3.8467 0.2991 0.1499
dipole: 3.8612
quadrupole: -105.9433 -104.9921 -119.6303
quadrupole: -0.8548 -3.7471 -1.9948
quadrupole: 4.2453 5.1965 -9.4417 -0.8548 -3.7471 -1.9948
hfenergy: -2200.6902376 hartree
pointgroup: C01 [X(C11H7Cl3S1)]
dipole: 1.509428 0.1518055 0.0791977 debye
dipolederiv: -1.0008902 -0.0916052 0.2104191 -0.1516233 -0.1433367 0.0304016 0.0946394 0.0135822 -0.1996009 -0.2212585 0.1722891 0.1060435 0.006362 -0.6549232 -0.3147646 -0.0963587 -0.3127765 -0.3771708 -0.2107628 -0.0085455 -0.000233 0.078245 -0.533565 0.3711033 -0.2129145 0.3353037 -0.5435456 0.1160913 -0.0459459 -0.180257 0.0088044 -0.1555605 -0.0342051 -0.2611467 -0.0181511 -0.1410637 -0.0657786 -0.1178772 0.0254655 -0.0747884 -0.0575342 0.04785 0.0291242 0.046983 0.0263285 0.2028522 -0.1120595 -0.0083886 -0.0182044 -0.0788842 0.028153 -0.0376468 0.0623603 0.0461994 0.0380667 0.0646964 -0.046862 -0.1924264 0.0034913 -0.0363724 0.032858 0.0041922 -0.0725377 -0.1431871 0.1139329 -0.0594306 -0.041847 0.1073163 -0.0481129 -0.0083001 -0.0930607 -0.1248494 0.1377486 0.1204457 -0.0374411 0.1626327 0.0707472 -0.0485533 -0.0070835 -0.0879847 -0.1763874 -0.064454 0.0832343 -0.0490517 -0.0743515 0.0828048 -0.0526913 -0.0097231 -0.0652663 -0.1305077 -0.1355721 0.0842224 -0.0405581 0.1537825 0.0686223 -0.0705096 -0.0403043 -0.0736919 -0.1431162 -0.1663929 -0.1579567 0.0152058 0.1716541 0.0023668 -0.0135988 0.0448538 -0.0008179 -0.0951621 -0.0627314 -0.1368962 -0.0052803 -0.089335 0.0651615 -0.0211136 -0.0088811 -0.0043783 -0.1503525 0.0880507 0.0658956 -0.0860009 0.0243344 -0.0019905 -0.0399752 -0.0703065 -0.0477185 -0.1139055 1.3125884 -0.0277004 -0.0958208 0.0521328 1.3151082 -0.0264636 0.3070422 0.0080554 1.2515919 0.0949324 -0.0167251 0.0316457 -0.0602867 -0.0096007 0.0350327 0.0263784 0.0168823 0.1217164 0.0259207 -0.0759616 0.0350051 -0.0306743 -0.0559475 0.041793 0.039923 0.0642107 0.1351238 0.0700368 -0.0804612 0.0422538 -0.0103977 -0.0549611 0.0478395 0.0251992 0.0599216 0.1317552 0.0634656 -0.0086178 0.0251372 -0.0842307 -0.0719009 0.0634581 0.0419255 0.0491381 0.135901 0.0454745 0.0933515 0.0230908 0.0747186 0.0419186 0.0118943 0.0061212 0.0146644 0.1309207 -0.011769 0.1067973 0.019965 0.1189723 -0.0300358 0.0087386 0.0246623 0.0080343 0.1537538 -0.1124314 -0.024513 0.0750925 -0.0234736 0.0907033 0.0200962 0.0799383 0.0205179 0.1349087 unknown
polarizability: 267.546002|-10.6250945|155.6714813|-21.480917|-8.842697|98.2831541 unknown
InChI: InChI=1S/C11H7Cl3S/c12-11(13,14)15-10-6-5-8-3-1-2-4-9(8)7-10/h1-7H
charge 0 multiplicity 1
22 atoms
Cl -5.18955 -0.519156 0.274243
Cl -2.798537 -1.793015 -1.097834
Cl -3.3425 1.151199 -1.464652
S  -2.488676 0.113208 1.359335
C  1.47482 -0.530871 0.308119
C  1.915975 0.795269 -0.078846
C  0.115248 -0.720102 0.720028
C  0.978853 1.881127 -0.035157
C  -0.767205 0.362085 0.741791
C  2.409404 -1.618533 0.268866
C  3.276886 0.980495 -0.489458
C  -0.341117 1.676496 0.36755
C  3.728716 -1.406628 -0.136484
C  4.165227 -0.09715 -0.51828
C  -3.413914 -0.253417 -0.227149
H  -0.227507 -1.717468 1.014598
H  1.312886 2.884431 -0.323433
H  2.072286 -2.6200 0.560656
H  3.612011 1.982419 -0.782318
H  -1.055041 2.504167 0.401575
H  4.436659 -2.241768 -0.165182
H  5.202978 0.054316 -0.834467
