program: Gaussian 09
title: 000249978
version: EM64L-G09RevD.01
frameworkgroup: C1[X(C12H17N)]
method: RPBEPBE
basis: SDD
operation: Freq
keyword: #pfreq=noraman
keyword: PBEPBE/SDD
title: #p freq=noraman PBEPBE/SDD
converged: YES YES NO NO
title: Mulliken charges:
elementType: N C C C C C C C C C C C C H H H H H H H H H H H H H H H H H
charge: -0.076669 -0.420855 -0.413073 -0.339597 -0.572743 -0.567211 0.341745 0.400766 -0.635960 -0.410076 -0.416201 -0.243740 -0.248498 0.249098 0.201556 0.208054 0.205253 0.201073 0.175358 0.209008 0.203432 0.188848 0.212238 0.225391 0.224432 0.187150 0.232470 0.231442 0.223506 0.223803
chargesum: 0.00000
title: Mulliken charges with hydrogens summed into heavy atoms:
elementType: N C C C C C C C C C C C C
charge: -0.076669 0.029799 0.000233 0.036835 -0.160302 -0.166125 0.341745 0.400766 0.001013 -0.177605 -0.184759 -0.020234 -0.024695
polarizability: 1.57825171e+02 -5.63643663e-01 1.40057731e+02 9.70159551e+00 6.87079212e+00 9.16686309e+01
1716.lowfreq: -8.1255 -0.0003 0.0005 0.0006 2.9500 19.0843 72.8799 94.2665 131.1554
frequency: 72.8356 94.2066 131.1457 146.0488 227.0815 248.8473 274.6481 284.0009 316.4886 358.9870 390.0791 403.8722 444.3323 473.8829 489.0578 512.0904 586.9603 616.8679 709.8367 749.3939 759.3983 763.1185 799.5804 828.3075 850.5151 881.8320 936.3435 946.6385 950.6737 956.8481 985.5275 987.4298 1030.8359 1040.1764 1060.8595 1085.5035 1104.1639 1111.4574 1143.0192 1159.8088 1165.1615 1174.9020 1190.0518 1204.8421 1230.4820 1240.2519 1270.7815 1292.1700 1299.0742 1313.8719 1344.9906 1348.3932 1359.3006 1372.8244 1384.7725 1431.4846 1438.4010 1460.6529 1462.5145 1465.5627 1469.7707 1473.3390 1485.6942 1486.3563 1494.3918 1589.3484 1612.6119 2821.1153 2841.5308 2857.8148 2965.5141 2987.1183 2992.2879 3016.8548 3018.4110 3022.3604 3026.6298 3045.7871 3061.8194 3076.8716 3111.3399 3117.7508 3135.3271 3157.3563
redmass: 3.1438 3.4554 3.2609 2.4320 1.1798 2.4859 3.4577 2.8993 2.6601 2.2793 2.3404 2.1789 2.3593 2.1898 3.1716 3.7142 3.1749 5.0784 2.1920 4.2105 1.3243 2.6514 1.9917 2.8154 2.7905 1.5820 1.8188 1.6705 1.7327 1.8925 1.4688 2.0171 1.8375 2.2643 1.9793 2.7781 1.6189 1.7999 1.9655 1.3510 1.2152 1.0799 1.8102 1.6592 2.2084 1.6389 1.2530 1.3085 1.3758 1.3434 1.2761 1.4569 1.3901 1.3999 4.4514 1.2549 2.0468 1.0850 1.0542 1.1064 1.0818 1.1067 1.2350 1.8292 1.0952 6.5991 6.3969 1.0706 1.0626 1.0666 1.0596 1.0632 1.0651 1.0713 1.0926 1.0918 1.0874 1.1017 1.0976 1.1007 1.0862 1.0886 1.0932 1.1006
irintensity: 0.6501 1.1661 0.1798 1.0857 0.0870 0.7236 1.6343 1.6986 0.8526 0.8881 2.1887 1.5643 1.9629 0.5435 2.0869 3.0365 2.6183 3.7586 29.0760 5.1209 41.4532 13.5319 17.1885 3.0550 2.6698 0.5678 0.4554 3.4866 3.0813 4.8782 2.0620 6.6640 11.7268 9.2654 1.9966 35.6546 3.3118 3.5917 11.4032 2.7714 1.2717 1.1760 5.0616 2.3020 0.4400 28.8669 1.4357 3.3579 0.9092 1.2122 0.1531 1.1374 8.1226 4.1994 0.6649 2.2541 1.9895 4.3688 21.3738 10.2797 7.9933 11.2573 1.2167 21.1720 19.7386 0.3657 0.8571 60.4712 89.5391 190.8223 32.9236 46.0064 36.2228 39.9630 37.6190 37.9344 50.2968 30.9008 44.9935 41.8894 11.4890 3.4377 33.4348 34.4746
temp: 298.150 k
press: 1.00000 atm
elementType: 7 6 6 6 6 6 6 6 6 6 6 6 6 1 1 1 1 1 1 1 1 1 1 1 1 1 1 1 1 1
symmnumber: 1
zpe: 689232.0 jmol-1
zpe.correction: 0.262515 hartree
zpe.thermalcorrener: 0.274139 hartree
zpe.thermalcorrenthalpy: 0.275084 hartree
zpe.thermalcorrgfe: 0.225578 hartree
zpe.sumelectzpe: -521.218254 hartree
zpe.sumelectthermal: -521.206629 hartree
zpe.sumelectthermalent: -521.205685 hartree
zpe.sumelectthermalfe: -521.255190 hartree
dipole: 0.8706 0.4988 0.5795
dipole: 1.1587
quadrupole: -73.6197 -73.8298 -82.4508
quadrupole: -0.9422 2.6782 0.0832
quadrupole: 3.0138 2.8036 -5.8174 -0.9422 2.6782 0.0832
hfenergy: -521.4807684 hartree
pointgroup: C01 [X(C12H17N1)]
dipole: -0.3507101 -0.1730229 0.2342701 debye
polarizability: 157.2874903|-1.8480259|140.2141324|-11.3125775|-6.1668735|92.0499101 unknown
InChI: InChI=1S/C12H17N/c1-13-9-5-4-7-11-6-2-3-8-12(11)10-13/h2-3,6,8H,4-5,7,9-10H2,1H3
charge 0 multiplicity 1
30 atoms
N  -2.013191 0.947551 -0.186853
C  -1.507082 -1.402634 -1.074882
C  -0.763096 -2.412194 -0.166014
C  -2.501307 -0.450433 -0.356935
C  0.042156 -1.771924 1.00448
C  -0.913963 1.114423 0.813857
C  0.953474 -0.658928 0.516846
C  0.475913 0.675713 0.358123
C  -3.137142 1.861841 0.122411
C  2.281222 -0.967565 0.124202
C  1.341638 1.651495 -0.199491
C  3.134191 0.012463 -0.427259
C  2.657947 1.332569 -0.596831
H  -0.78601 -0.779475 -1.633413
H  -2.062928 -1.988986 -1.832751
H  -0.066674 -3.000037 -0.797103
H  -1.490438 -3.131469 0.262567
H  -3.421849 -0.378337 -0.966033
H  -2.81237 -0.894849 0.626773
H  0.63676 -2.564215 1.49765
H  -0.670384 -1.392022 1.760446
H  -1.181165 0.610815 1.777542
H  -0.863671 2.196478 1.035787
H  -3.903157 1.785965 -0.669923
H  -2.774257 2.904972 0.145847
H  -3.638027 1.650709 1.102741
H  2.646117 -1.994258 0.255393
H  0.971185 2.676528 -0.324379
H  4.157906 -0.24853 -0.719006
H  3.306906 2.104836 -1.024893
