program: Gaussian 09
title: 000249992
version: EM64L-G09RevD.01
frameworkgroup: C1[X(C13H19N3O2)]
method: RPBEPBE
basis: SDD
operation: Freq
keyword: #p
keyword: freq=noraman
keyword: PBEPBE/SDD
title: #p freq=noraman PBEPBE/SDD
converged: YES YES NO NO
title: Mulliken charges:
elementType: O O N N N C C C C C C C C C C C C C H H H H H H H H H H H H H H H H H H H
charge: -0.342390 -0.257675 -0.141083 0.023289 -0.128432 -0.138360 -0.494534 -0.420339 -0.389916 0.475489 -0.641150 -0.301983 -0.561784 -0.318467 0.155911 0.293294 -0.603696 -0.608999 0.201259 0.241099 0.217510 0.211088 0.226264 0.178391 0.228384 0.225396 0.189644 0.245808 0.275857 0.253004 0.253060 0.277237 0.227200 0.223110 0.222453 0.280479 0.223581
chargesum: 0.00000
title: Mulliken charges with hydrogens summed into heavy atoms:
elementType: O O N N N C C C C C C C C C C C C C
charge: -0.342390 -0.257675 -0.141083 0.023289 -0.128432 0.062899 -0.035925 0.017013 0.016859 0.475489 0.019699 -0.026126 -0.308780 -0.065407 0.155911 0.293294 0.123851 0.117514
polarizability: 2.48822361e+02 -4.31431542e+00 1.29631207e+02 -1.94688802e-01 -2.76254548e+00 1.35271208e+02
1716.lowfreq: -19.4921 -4.7076 -0.0007 -0.0002 0.0004 4.2595 13.6405 25.8606 33.8646
frequency: 10.9076 25.4421 33.5191 47.6970 54.6065 83.5709 92.2852 109.7161 127.6804 134.7646 158.3939 188.1112 211.8817 234.9256 245.9708 298.8288 307.5048 334.3540 361.7953 400.9755 410.0297 432.1992 468.3588 526.7270 562.8733 589.0836 621.1529 622.7669 640.7310 682.7067 728.0103 748.2310 783.4944 803.5881 839.2838 855.9415 878.5414 901.4905 918.0828 932.2271 965.2065 973.5436 989.4405 1000.5307 1031.7166 1052.0068 1057.2095 1087.7313 1098.5869 1103.6026 1106.8420 1115.5435 1148.7061 1149.8786 1178.2288 1201.8809 1207.3755 1209.9566 1221.9325 1249.9848 1250.7245 1259.1953 1284.9073 1287.6363 1307.9727 1317.0851 1331.5805 1341.0190 1370.4475 1389.4630 1420.3431 1431.1594 1432.2289 1461.8823 1465.8616 1468.1422 1471.4673 1475.8284 1476.5098 1480.3436 1486.5829 1491.1718 1500.3304 1561.5126 1588.0431 1690.0403 2814.7990 2844.8489 2865.6695 2965.1517 2971.6541 3012.8769 3024.6515 3029.0633 3035.6466 3037.1229 3044.0173 3068.0344 3085.3893 3092.6498 3117.5815 3123.8537 3146.9969 3148.2028 3179.5652
redmass: 3.3607 3.9890 2.9432 3.0502 3.2605 1.5570 2.2399 2.4729 2.7931 1.2229 3.5324 4.2443 2.5931 1.2667 2.5372 3.4990 3.7679 3.4833 3.5064 4.3469 3.3193 3.7740 4.7856 3.9028 3.3336 4.5835 4.1628 6.2006 5.5547 8.3019 2.8910 2.8936 4.3687 2.3124 5.0067 1.6068 3.1994 1.8498 2.1030 1.6905 1.9929 3.9846 1.3836 2.6619 2.2348 2.2599 1.3737 2.2617 1.2192 2.3682 1.3045 1.3345 1.6630 1.3714 1.6471 1.8645 3.1944 2.0958 1.8570 2.5421 2.0915 1.3533 1.2348 1.4305 1.5065 2.3502 5.0146 1.4932 3.0079 1.8547 1.1532 1.1726 1.1911 2.3279 1.1118 1.0576 1.0510 1.0447 1.0544 1.0824 1.0455 1.1001 1.1952 6.7224 6.2836 9.2319 1.0803 1.0709 1.0573 1.0378 1.0371 1.0592 1.0676 1.0734 1.1013 1.0827 1.1018 1.1048 1.1009 1.1052 1.0916 1.0973 1.0903 1.0949 1.0967
irintensity: 0.2325 4.6607 1.7526 0.6172 2.9343 0.1926 0.9692 1.5553 0.0811 0.0372 1.0000 0.3295 0.1328 2.7790 5.0669 3.4559 5.6531 10.7000 2.3314 14.0098 6.0840 1.1438 8.9343 7.8664 4.3250 1.3114 9.1657 1.2906 2.8015 11.5059 14.3692 12.6250 3.7688 13.6435 28.0001 40.8234 12.4319 17.0346 7.5674 2.7557 2.2355 103.0844 0.9201 6.1959 9.0413 55.7887 26.2852 16.2879 0.1212 863.1073 43.2225 18.0550 11.6359 0.7402 7.6472 9.0899 187.6445 43.0486 0.8848 6.6103 9.9578 2.7723 5.1270 7.9597 4.7619 63.0872 39.5503 8.9940 150.2846 4.9843 28.9500 5.8827 28.0585 79.2901 20.7119 13.3849 22.8571 0.3789 5.8462 11.2163 35.6027 1.2539 15.6794 37.3336 24.6347 415.1641 47.6639 94.0574 176.3325 37.1458 136.2495 25.5698 46.6993 36.3205 46.3671 54.5678 30.2951 1.5229 29.7853 55.2236 23.2548 2.2564 2.6728 3.8158 5.5855
temp: 298.150 k
press: 1.00000 atm
elementType: 8 8 7 7 7 6 6 6 6 6 6 6 6 6 6 6 6 6 1 1 1 1 1 1 1 1 1 1 1 1 1 1 1 1 1 1 1
symmnumber: 1
zpe: 802739.8 jmol-1
zpe.correction: 0.305747 hartree
zpe.thermalcorrener: 0.324463 hartree
zpe.thermalcorrenthalpy: 0.325407 hartree
zpe.thermalcorrgfe: 0.255308 hartree
zpe.sumelectzpe: -820.101219 hartree
zpe.sumelectthermal: -820.082503 hartree
zpe.sumelectthermalent: -820.081559 hartree
zpe.sumelectthermalfe: -820.151659 hartree
dipole: -0.7905 -2.1819 0.4914
dipole: 2.3721
quadrupole: -74.9412 -110.2320 -105.0314
quadrupole: -7.6868 3.3297 -0.0495
quadrupole: 21.7937 -13.4971 -8.2965 -7.6868 3.3297 -0.0495
hfenergy: -820.4069665 hartree
pointgroup: C01 [X(C13H19N3O2)]
dipole: 0.2944871 0.8819782 0.0798911 debye
polarizability: 248.9418735|-1.8268222|130.2855416|-0.9281329|3.4180688|134.4973613 unknown
InChI: InChI=1S/C13H19N3O2/c1-15(2)13(17)18-12-7-6-10(9-14-12)11-5-4-8-16(11)3/h6-7,9,11H,4-5,8H2,1-3H3
charge 0 multiplicity 1
37 atoms
O  -2.607401 0.464565 0.665968
O  -3.152738 -1.793167 0.203201
N  3.756475 -0.679672 0.495475
N  -0.876223 0.009393 -0.880742
N  -4.778999 -0.097763 0.102208
C  2.942179 0.016901 -0.539913
C  3.640551 1.410964 -0.644222
C  5.117743 1.164518 -0.194033
C  5.166839 -0.338392 0.185805
C  1.470206 0.093147 -0.17443
C  3.494905 -2.123139 0.627857
C  1.055492 0.39419 1.150229
C  0.45883 -0.096558 -1.144596
C  -0.317068 0.487929 1.448895
C  -1.231025 0.288185 0.389724
C  -3.507776 -0.595231 0.281251
C  -5.871702 -1.046791 -0.16359
C  -5.132917 1.328324 0.15511
H  3.031405 -0.502868 -1.531139
H  3.140071 2.126572 0.030177
H  3.56529 1.811144 -1.669953
H  5.84316 1.398875 -0.992171
H  5.362539 1.795814 0.676793
H  5.550962 -0.941014 -0.677504
H  5.815249 -0.547218 1.055492
H  4.114056 -2.539028 1.442386
H  3.722098 -2.694575 -0.307477
H  2.435105 -2.293378 0.884342
H  1.816837 0.518818 1.927554
H  0.719796 -0.341992 -2.181611
H  -0.686343 0.696712 2.455859
H  -5.462799 -2.067946 -0.173285
H  -6.336593 -0.834384 -1.145349
H  -6.649934 -0.971113 0.620117
H  -5.641875 1.625703 -0.782139
H  -4.225172 1.932198 0.278814
H  -5.817421 1.528577 1.002801
