program: Gaussian 09
title: 000249976
version: EM64L-G09RevD.01
frameworkgroup: C1[X(C16H19NO)]
method: RPBEPBE
basis: SDD
operation: Freq
keyword: #p
keyword: freq=noraman
keyword: PBEPBE/SDD
title: #p freq=noraman PBEPBE/SDD
converged: YES YES NO NO
title: Mulliken charges:
elementType: O N C C C C C C C C C C C C C C C C H H H H H H H H H H H H H H H H H H H
charge: -0.440725 -0.100508 0.228697 0.347731 -0.333386 -0.550570 0.373917 -0.366027 -0.434843 -0.256356 -0.243069 -0.373721 -0.439224 -0.619592 -0.614784 -0.236085 -0.223143 -0.248920 0.293112 0.255231 0.198978 0.264614 0.239127 0.228801 0.228000 0.246741 0.263054 0.245903 0.186114 0.222719 0.224353 0.190296 0.236181 0.333904 0.224097 0.223178 0.226202
chargesum: 0.00000
title: Mulliken charges with hydrogens summed into heavy atoms:
elementType: O N C C C C C C C C C C C C C C C C
charge: -0.106821 -0.100508 0.228697 0.347731 -0.040274 -0.096360 0.373917 -0.101413 -0.195716 -0.027554 -0.015069 -0.126980 -0.176170 0.035143 0.036047 -0.011987 0.000035 -0.022718
polarizability: 2.23472725e+02 -5.58189162e+00 1.67250840e+02 1.76430214e+00 -1.24111498e+01 1.44165306e+02
1716.lowfreq: -9.0872 -5.0832 -0.0007 -0.0007 -0.0004 7.0728 27.0282 30.0559 53.2829
frequency: 26.7688 30.0159 53.2507 62.5612 72.3347 99.9034 127.1256 192.6522 196.6569 229.1012 240.6130 244.4903 261.0471 311.2945 325.1113 343.7669 367.3657 404.0800 406.7688 417.6754 426.6230 456.7812 490.9295 554.5277 601.7212 614.4184 616.4559 641.5994 704.9171 721.7688 744.2614 767.2629 807.8189 816.7739 820.4101 859.5813 870.5267 892.4832 930.0149 931.8743 959.5128 976.1191 981.9127 989.2493 993.6866 996.7218 1018.8698 1027.1136 1035.8547 1047.3653 1079.7197 1088.4081 1088.5965 1134.9457 1167.7320 1170.0251 1173.6583 1177.0370 1185.2837 1200.8384 1204.9868 1235.4952 1253.3227 1264.8227 1279.9323 1312.1585 1315.5809 1364.8428 1375.1865 1381.3594 1400.1103 1417.9897 1432.9652 1438.4041 1444.0109 1460.5935 1466.5776 1475.8642 1476.8968 1479.0938 1483.0588 1488.4467 1585.4261 1590.7871 1610.3973 1612.6439 2849.8560 2852.7019 2869.6749 3008.5078 3020.2068 3022.2236 3028.6869 3080.7963 3088.4739 3114.3491 3118.0168 3125.6769 3126.7717 3138.7349 3140.6388 3151.6967 3159.8425 3163.3752 3526.7880
redmass: 3.8897 3.7941 3.2368 3.5713 4.0869 4.0969 4.3042 3.7394 2.7032 1.6271 1.5510 1.6772 3.4829 3.1072 2.5111 2.3287 1.4793 2.3626 2.6942 4.3073 2.5203 3.5940 3.3472 3.9299 5.3890 5.1923 5.8319 4.4922 2.6113 1.9120 2.7507 1.4564 2.5108 3.5760 4.2309 1.2512 4.2828 1.4295 1.6918 3.6583 1.4835 1.7206 1.5100 3.7133 1.3318 1.3729 2.4592 2.1493 1.5515 2.1660 1.5740 1.2614 2.2078 1.4055 1.8358 1.0846 1.3174 1.4225 1.1846 1.6436 1.8071 2.1461 2.3604 1.7844 1.6381 1.3426 1.3393 1.4228 3.6913 4.0732 1.5063 1.1432 2.1258 1.8013 1.3543 1.0460 1.0663 1.1235 1.3662 1.8920 1.6442 1.1136 6.4294 6.2926 6.3789 6.0643 1.0675 1.0579 1.0585 1.0846 1.0858 1.0741 1.0730 1.1014 1.1010 1.0871 1.0848 1.0876 1.0876 1.0931 1.0933 1.0949 1.1006 1.1004 1.0661
irintensity: 0.9828 0.2166 0.1511 0.6865 0.0562 0.4151 0.4210 0.2205 0.6670 0.4792 1.0478 1.9294 2.4108 0.7503 25.8228 3.3491 144.6684 2.3765 8.1689 5.0421 4.2553 9.3181 4.9873 1.0069 38.5029 2.7606 0.5010 14.9048 19.2268 62.5121 45.5805 51.5871 15.6565 29.8285 7.0493 0.7535 16.4591 1.8859 18.7401 45.7958 3.1386 5.6962 0.7077 0.1745 0.1592 0.3221 56.8267 6.4748 9.2169 4.9327 1.7972 5.5123 2.0655 5.3634 4.9962 0.2717 3.9899 2.4221 2.3337 18.7835 28.0806 19.2797 7.4029 1.7283 18.9867 0.7748 5.4789 8.7164 3.1365 2.5245 9.9107 4.6462 11.5228 4.5127 7.5302 11.2680 2.5223 18.2576 24.1080 6.5809 11.4678 19.7500 0.3529 0.2267 0.6397 10.0719 48.8759 62.8205 309.7768 42.5982 14.8359 25.5836 35.4445 22.1729 37.3205 9.8149 4.4678 3.0501 4.1762 36.7149 19.1862 24.7192 32.0303 23.0282 5.0841
temp: 298.150 k
press: 1.00000 atm
elementType: 8 7 6 6 6 6 6 6 6 6 6 6 6 6 6 6 6 6 1 1 1 1 1 1 1 1 1 1 1 1 1 1 1 1 1 1 1
symmnumber: 1
zpe: 811151.6 jmol-1
zpe.correction: 0.308951 hartree
zpe.thermalcorrener: 0.326153 hartree
zpe.thermalcorrenthalpy: 0.327097 hartree
zpe.thermalcorrgfe: 0.262844 hartree
zpe.sumelectzpe: -749.731123 hartree
zpe.sumelectthermal: -749.713922 hartree
zpe.sumelectthermalent: -749.712978 hartree
zpe.sumelectthermalfe: -749.777231 hartree
dipole: -1.1899 0.9521 -0.8579
dipole: 1.7488
quadrupole: -96.0240 -103.9936 -105.8590
quadrupole: 2.8653 1.4690 1.6042
quadrupole: 5.9348 -2.0347 -3.9001 2.8653 1.4690 1.6042
hfenergy: -750.0400743 hartree
pointgroup: C01 [X(C16H19N1O1)]
dipole: 0.5129969 -0.1978077 -0.4136201 debye
polarizability: 224.1281804|-0.5302214|156.0990824|-0.3315498|16.6101123|154.6616086 unknown
InChI: InChI=1S/C16H19NO/c1-17(2)12-14-10-6-7-11-15(14)16(18)13-8-4-3-5-9-13/h3-11,16,18H,12H2,1-2H3
charge 0 multiplicity 1
37 atoms
O  -0.397632 -0.217418 2.200722
N  2.136387 2.063348 0.352538
C  0.659085 -0.740972 0.041578
C  2.051162 -0.444873 0.168918
C  -0.367242 0.146225 0.755751
C  2.53439 0.764403 0.962948
C  -1.767664 0.168346 0.13847
C  0.260015 -1.902262 -0.665617
C  2.995039 -1.318153 -0.420758
C  1.213762 -2.769799 -1.244904
C  2.589217 -2.475883 -1.124566
C  -1.932564 0.435642 -1.246648
C  -2.9219 -0.002373 0.940286
C  2.773156 2.300497 -0.958924
C  2.339713 3.1918 1.285286
C  -3.221127 0.517139 -1.816546
C  -4.213986 0.070502 0.368992
C  -4.369801 0.329011 -1.011243
H  0.031478 1.177093 0.765687
H  2.089811 0.730494 1.975642
H  3.645615 0.696268 1.085109
H  -0.808196 -2.12338 -0.769976
H  4.063285 -1.087489 -0.32387
H  0.884507 -3.663447 -1.786865
H  3.338509 -3.137739 -1.573162
H  -1.047861 0.580285 -1.878309
H  -2.798678 -0.168028 2.015421
H  2.546596 1.465459 -1.643257
H  3.886756 2.399765 -0.890036
H  2.372248 3.229994 -1.400963
H  1.966374 4.123767 0.824758
H  3.413327 3.349642 1.560396
H  1.769552 3.013918 2.214474
H  -0.556031 -1.195561 2.265845
H  -3.330449 0.72639 -2.886968
H  -5.096939 -0.065856 1.00418
H  -5.370614 0.389347 -1.453691
