program: Gaussian 09
title: 000249972
version: EM64L-G09RevD.01
frameworkgroup: C1[X(C13H8F3NO4)]
method: RPBEPBE
basis: SDD
operation: Freq
keyword: #p
keyword: freq=noraman
keyword: PBEPBE/SDD
title: #p freq=noraman PBEPBE/SDD
converged: YES YES NO NO
title: Mulliken charges:
elementType: F F F O O O O N C C C C C C C C C C C C C H H H H H H H H
charge: -0.165080 -0.162554 -0.158115 -0.257701 -0.429408 -0.198772 -0.165951 0.010154 0.235388 0.329780 0.267458 -0.482641 -0.300179 -0.322113 0.389430 0.262598 -0.480296 -0.407414 0.331268 -0.150037 -0.408146 0.314283 0.286415 0.268605 0.291769 0.271171 0.237414 0.229926 0.362748
chargesum: 0.00000
title: Mulliken charges with hydrogens summed into heavy atoms:
elementType: F F F O O O O N C C C C C C C C C C C C C
charge: -0.165080 -0.162554 -0.158115 -0.257701 -0.066660 -0.198772 -0.165951 0.010154 0.235388 0.329780 0.267458 -0.168358 -0.013764 -0.053508 0.389430 0.262598 -0.188527 -0.136244 0.331268 0.087377 -0.178219
polarizability: 2.40528822e+02 -1.28590460e+01 1.66805881e+02 -2.01519895e+01 -6.58865939e+00 1.12411402e+02
1716.lowfreq: -15.8442 -2.7139 -0.0009 -0.0007 -0.0003 4.7430 5.4253 20.1172 30.8955
frequency: -14.8764 20.0400 30.8689 38.5675 48.7566 84.3462 126.8087 135.2791 164.3577 215.4089 220.2692 224.8974 257.8322 291.7513 333.7534 346.6824 363.8463 368.7749 388.5767 422.8358 442.4083 451.4230 472.1118 501.9940 513.8547 533.6838 557.5811 579.3288 598.3989 644.3577 656.6109 674.4836 686.1957 693.0232 726.3424 744.1518 777.9901 785.3533 833.3622 853.5858 869.0727 879.2296 932.4567 936.7649 963.9630 971.2300 983.5401 986.9891 1031.9246 1037.4950 1066.9725 1078.8657 1113.1793 1152.3704 1169.0673 1174.5873 1202.5992 1239.3451 1253.0684 1264.4027 1290.1492 1298.0513 1366.3492 1382.7255 1395.8148 1424.5454 1458.3590 1473.9758 1492.1672 1574.8852 1604.4823 1614.7453 1629.0605 3128.6826 3159.3327 3160.1351 3176.1537 3181.3481 3185.9437 3187.5716 3586.1583
redmass: 16.9419 5.9127 7.0456 13.2738 8.5122 8.6733 12.3661 5.3808 8.5671 6.4079 9.9813 4.7311 10.1011 8.6994 10.0534 8.2581 1.1171 7.8627 9.5684 4.2196 4.2909 3.1896 7.1550 9.8223 7.4895 7.2958 5.5488 7.7190 7.2906 5.9818 7.5643 3.8116 3.2193 6.7432 8.4383 4.6342 1.6419 5.7004 1.4576 7.8180 1.4305 1.5167 1.5840 3.6544 1.3182 1.3547 6.1250 8.1341 6.9050 8.0219 3.0049 1.5817 1.6265 1.4209 1.3003 1.1893 8.8405 2.8262 1.9221 4.2638 1.4993 2.1576 7.0172 7.2711 8.2073 5.5617 2.6559 2.7642 3.0610 8.3771 7.4256 6.2783 6.7191 1.0895 1.0928 1.0896 1.0933 1.0957 1.0929 1.0972 1.0662
irintensity: 0.2951 0.6684 0.7562 0.5952 0.1744 2.5046 4.0821 0.4832 1.3413 1.0047 0.6642 0.7365 3.1152 6.4801 1.5689 1.3848 140.4429 2.7086 4.2907 3.5681 7.4141 7.2567 1.5122 3.9856 2.9039 5.0438 5.4776 19.8938 13.1679 9.3512 10.1187 20.6998 4.2716 2.2298 33.1220 13.2986 50.5689 19.5694 50.1028 27.3261 1.1664 19.6462 97.6880 94.3075 1.0007 1.4098 10.1490 189.2336 137.7041 209.9074 25.1479 19.2350 127.4546 113.1205 11.0680 16.6884 299.7355 88.5526 210.9234 236.6944 109.0742 192.1781 106.5358 19.7165 15.7010 8.2927 121.1603 64.3635 87.8300 51.2311 87.5770 185.9916 66.1969 10.0459 14.7003 0.4322 0.2234 0.1236 9.8953 1.1526 51.0068
temp: 298.150 k
press: 1.00000 atm
elementType: 9 9 9 8 8 8 8 7 6 6 6 6 6 6 6 6 6 6 6 6 6 1 1 1 1 1 1 1 1
symmnumber: 1
zpe: 495778.3 jmol-1
zpe.correction: 0.188832 hartree
zpe.thermalcorrener: 0.206185 hartree
zpe.thermalcorrenthalpy: 0.207129 hartree
zpe.thermalcorrgfe: 0.141296 hartree
zpe.sumelectzpe: -1153.761567 hartree
zpe.sumelectthermal: -1153.744215 hartree
zpe.sumelectthermalent: -1153.743270 hartree
zpe.sumelectthermalfe: -1153.809103 hartree
dipole: 6.8130 -4.5525 -1.9903
dipole: 8.4323
quadrupole: -102.1405 -133.0339 -119.8953
quadrupole: -13.4804 -1.0580 -3.7762
quadrupole: 16.2161 -14.6773 -1.5388 -13.4804 -1.0580 -3.7762
hfenergy: -1153.9503993 hartree
pointgroup: C01 [X(C13H8F3N1O4)]
dipole: 2.5414083 -2.1057323 -0.3364095 debye
polarizability: 238.8657769|-21.5377508|165.5504697|-13.6373578|-15.4899583|115.3298583 unknown
InChI: InChI=1S/C13H8F3NO4/c14-13(15,16)8-4-5-12(11(6-8)17(19)20)21-10-3-1-2-9(18)7-10/h1-7,18H
charge 0 multiplicity 1
29 atoms
F  -4.396565 -1.879162 -1.070416
F  -4.304324 -1.602845 1.171707
F  -5.027843 0.098844 -0.143009
O  1.327456 0.943687 -0.450802
O  3.918757 -2.135099 2.266558
O  -1.692664 3.53892 0.517798
O  0.183519 3.354852 -0.768515
N  -0.821999 2.848531 -0.147189
C  0.032774 0.45494 -0.365783
C  -2.66019 -0.434772 -0.186476
C  -1.03958 1.383214 -0.209862
C  -2.371895 0.937092 -0.100797
C  -0.279616 -0.929436 -0.446555
C  -1.608201 -1.369001 -0.366935
C  2.459808 0.085393 -0.271848
C  -4.069721 -0.93189 -0.062998
C  2.614668 -0.664478 0.909271
C  3.450641 0.142659 -1.272171
C  3.808885 -1.401421 1.07741
C  4.636176 -0.599266 -1.076043
C  4.823744 -1.376925 0.087859
H  -3.160646 1.679227 0.047078
H  0.529324 -1.652389 -0.577855
H  -1.831655 -2.437002 -0.451451
H  1.858193 -0.673401 1.698583
H  3.291853 0.761641 -2.158311
H  5.422542 -0.570797 -1.836943
H  5.749341 -1.949061 0.226137
H  4.793518 -2.593255 2.326257
