program: Gaussian 09
title: 000249980
version: EM64L-G09RevD.01
frameworkgroup: C1[X(C28H18Br2)]
method: RPBEPBE
basis: SDD
operation: Freq
keyword: #p
keyword: freq=noraman
keyword: PBEPBE/SDD
title: #p freq=noraman PBEPBE/SDD
converged: NO YES NO NO
title: Mulliken charges:
elementType: Br Br C C C C C C C C C C C C C C C C C C C C C C C C C C C C H H H H H H H H H H H H H H H H H H
charge: -0.000737 -0.000737 -0.682663 -0.682664 -0.660244 -0.660244 0.494739 0.494738 0.494739 0.494738 0.431720 0.431720 0.431720 0.431721 -0.388027 -0.388024 -0.388025 -0.388026 -0.476725 -0.476725 -0.476725 -0.476725 -0.249084 -0.249086 -0.249085 -0.249085 -0.241983 -0.241983 -0.241983 -0.241983 0.305406 0.305406 0.243834 0.243833 0.243833 0.243833 0.247929 0.247929 0.247929 0.247929 0.228322 0.228321 0.228322 0.228322 0.228395 0.228395 0.228395 0.228395
chargesum: 0.00000
title: Mulliken charges with hydrogens summed into heavy atoms:
elementType: Br Br C C C C C C C C C C C C C C C C C C C C C C C C C C C C
charge: -0.000737 -0.000737 -0.682663 -0.682664 -0.354838 -0.354838 0.494739 0.494738 0.494739 0.494738 0.431720 0.431720 0.431720 0.431721 -0.144193 -0.144191 -0.144192 -0.144193 -0.228796 -0.228796 -0.228796 -0.228796 -0.020763 -0.020764 -0.020764 -0.020763 -0.013588 -0.013588 -0.013588 -0.013588
polarizability: 3.25134220e+02 -4.19588911e-02 3.68149763e+02 3.91791632e+01 -1.88802179e-02 2.41929009e+02
1716.lowfreq: -10.2533 -0.0003 -0.0002 0.0004 5.0051 7.1031 46.2769 55.4014 62.8815
frequency: 46.2769 55.4014 62.8780 65.5532 93.2326 110.5471 131.5934 135.5805 137.8130 141.3358 147.3143 171.3618 179.9297 184.1160 186.9218 282.9121 291.4541 305.6741 310.3645 310.9347 349.0960 355.4047 381.0405 385.3716 417.9038 440.5460 453.3681 470.6564 504.8664 508.4105 518.0984 536.3258 551.1135 600.5919 608.0950 615.2467 623.4432 623.5839 635.1603 647.5535 686.0676 695.3282 719.2131 733.0006 738.3965 745.1691 756.2962 763.1630 764.2448 779.9737 796.9728 803.5738 811.0631 833.8267 854.8096 865.9684 873.3520 875.1565 882.1804 889.4477 891.5628 906.4422 929.3974 929.6711 955.9191 956.0006 956.7705 963.7260 989.6928 989.8347 991.1988 991.5741 1039.5675 1041.6597 1043.6259 1044.4629 1079.2345 1089.3373 1097.6261 1113.6359 1152.9903 1155.9515 1171.7054 1171.9187 1176.2692 1177.4772 1181.1992 1181.7595 1192.7013 1200.8072 1208.9237 1211.3402 1234.7022 1243.3125 1255.5815 1259.9073 1286.6624 1291.8072 1308.5666 1312.6498 1380.4207 1380.4287 1380.9667 1386.0477 1438.9393 1439.2572 1440.8363 1441.7998 1460.0657 1460.8534 1470.2549 1475.2687 1580.6981 1581.3375 1589.3354 1592.4530 1605.2829 1607.8202 1612.7267 1613.8196 3069.4030 3069.9660 3121.8438 3121.9045 3122.0676 3122.2536 3136.4364 3136.5475 3136.5584 3136.6741 3155.9602 3156.0750 3156.2125 3156.3145 3170.1793 3170.4717 3170.4897 3170.9103
redmass: 7.4005 6.9634 5.0720 5.1662 4.7316 7.3011 4.0018 7.3810 11.4206 3.7677 4.2907 8.4530 8.0884 12.6224 8.0034 6.5466 5.5194 4.3741 5.3828 4.7394 4.2750 4.5438 5.0268 5.1389 5.3476 4.2897 3.4918 3.7194 4.2425 4.2802 4.7918 4.0252 5.1051 5.5525 6.3048 4.8615 5.6851 4.2489 6.1994 6.2430 3.3144 5.5549 5.9903 5.6406 4.6500 4.6021 1.2582 1.3349 1.2406 1.9261 3.4007 4.8762 2.9732 5.5804 5.7195 1.6908 1.4149 5.1620 1.4614 3.3386 1.7467 5.3330 5.3020 3.8845 1.4603 1.4189 1.3872 1.5092 1.3362 1.3339 1.3302 1.3350 2.4630 2.4285 2.1325 2.1750 2.8756 2.3979 3.0935 2.6054 1.9262 1.8436 1.3468 1.2861 1.0704 1.0710 1.6003 1.4410 1.3231 1.5060 2.9578 2.4693 2.5591 2.8038 1.2830 1.3418 1.3839 1.3716 1.7116 1.7444 4.8517 5.1990 8.1697 7.6916 2.3062 2.3326 2.4786 2.4821 2.3824 2.3882 2.7183 2.6780 6.1678 6.2143 6.8433 6.8285 6.6098 6.6750 6.6898 6.8432 1.0862 1.0861 1.0876 1.0876 1.0876 1.0876 1.0891 1.0893 1.0892 1.0894 1.0945 1.0947 1.0945 1.0948 1.0976 1.0977 1.0976 1.0978
irintensity: 0.3945 2.1460 0.0000 0.4484 0.0000 0.0000 0.0855 0.2525 0.0000 0.0000 0.0577 0.2014 0.0000 0.0000 4.3402 7.2150 0.0000 2.4124 0.0000 0.0000 1.7880 0.0000 0.8044 0.0000 0.0000 6.3190 0.0000 10.0305 0.0000 0.3002 0.0000 0.2785 0.0000 0.0000 9.1265 0.0000 0.6525 71.4973 0.0000 25.2056 81.4638 0.0000 0.0000 16.7818 0.0000 0.0034 0.0000 0.0000 26.7391 141.6184 102.5606 0.0298 0.0000 21.7170 0.0000 1.1621 0.1631 0.0000 0.0000 0.0000 0.0000 0.0000 0.3518 7.2690 0.0000 5.3452 0.0899 0.0000 0.0382 0.0000 0.0000 0.1994 6.4906 0.0001 0.0000 15.0258 0.0000 1.6802 0.5303 0.0000 0.0001 20.0617 0.0089 0.0000 0.3167 0.0000 0.0000 2.1512 0.0000 5.1221 0.0000 2.1000 7.8197 0.0000 0.0001 5.3562 0.0002 26.1817 0.0000 4.5395 0.0004 0.7789 1.8022 0.0000 49.5337 0.0009 2.7349 0.0000 0.0000 52.4051 20.9450 0.0000 0.0001 0.1715 5.5809 0.0000 0.1927 0.0000 1.2497 0.0000 7.4300 0.0000 2.7283 0.0024 0.0001 8.7740 0.0435 6.0928 33.4048 0.0082 39.6711 0.0081 0.0065 32.8730 0.0001 60.0290 24.6837 0.0079
temp: 298.150 k
press: 1.00000 atm
elementType: 35 35 6 6 6 6 6 6 6 6 6 6 6 6 6 6 6 6 6 6 6 6 6 6 6 6 6 6 6 6 1 1 1 1 1 1 1 1 1 1 1 1 1 1 1 1 1 1
symmnumber: 1
zpe: 958450.0 jmol-1
zpe.correction: 0.365054 hartree
zpe.thermalcorrener: 0.387755 hartree
zpe.thermalcorrenthalpy: 0.388699 hartree
zpe.thermalcorrgfe: 0.313992 hartree
zpe.sumelectzpe: -1102.702410 hartree
zpe.sumelectthermal: -1102.679709 hartree
zpe.sumelectthermalent: -1102.678765 hartree
zpe.sumelectthermalfe: -1102.753472 hartree
dipole: 0.0000 0.0000 0.0000
dipole: 0.0000
quadrupole: -194.1494 -167.4934 -186.1409
quadrupole: 0.0002 7.6221 -0.0001
quadrupole: -11.5548 15.1012 -3.5464 0.0002 7.6221 -0.0001
hfenergy: -1103.0674645 hartree
pointgroup: C01 [X(C28H18Br2)]
dipole: 0.0000015 0.0000002 0.0000004 debye
polarizability: 368.1497633|-0.0127208|238.0913464|0.044148|-34.6549508|328.9718823 unknown
InChI: InChI=1S/C28H18Br2/c29-27-21-13-5-1-9-17(21)25(18-10-2-6-14-22(18)27)28(30)23-15-7-3-11-19(23)26(27)20-12-4-8-16-24(20)28/h1-16,25-26H
charge 0 multiplicity 1
48 atoms
Br 0.000049 -1.812183 3.204586
Br -0.000016 1.812216 -3.204565
C  0.000036 -1.030929 1.279351
C  0.000002 1.030963 -1.27933
C  0.000027 0.591888 1.48504
C  0.000011 -0.591854 -1.485019
C  1.250908 -1.507536 0.519877
C  -1.250841 -1.507551 0.519897
C  1.250879 1.507585 -0.519876
C  -1.250869 1.507569 -0.519856
C  -1.233464 -1.2511 -0.882227
C  1.233505 -1.251084 -0.882247
C  1.233502 1.251134 0.882248
C  -1.233467 1.251117 0.882268
C  2.378551 -2.132101 1.089394
C  -2.378465 -2.132131 1.089434
C  2.378504 2.132165 -1.089412
C  -2.378512 2.132133 -1.089374
C  -2.326741 -1.637767 -1.684229
C  2.326774 -1.637736 -1.684268
C  2.326778 1.637801 1.684251
C  -2.326737 1.637768 1.684287
C  3.473658 -2.515285 0.280461
C  -3.473581 -2.51533 0.28052
C  3.473619 2.515365 -0.280497
C  -3.47362 2.515317 -0.280442
C  3.450684 -2.271305 -1.109447
C  -3.450633 -2.271351 -1.109389
C  3.45067 2.271386 1.109412
C  -3.450646 2.271337 1.109466
H  0.000034 0.756949 2.572755
H  0.000003 -0.756916 -2.572734
H  2.40062 -2.334109 2.163505
H  -2.400513 -2.334138 2.163546
H  2.400553 2.334173 -2.163524
H  -2.40058 2.334141 -2.163485
H  -2.296864 -1.439425 -2.762195
H  2.296876 -1.439393 -2.762234
H  2.296901 1.439459 2.762218
H  -2.296839 1.439426 2.762253
H  4.338146 -3.007233 0.73945
H  -4.338055 -3.007289 0.739525
H  4.338093 3.007324 -0.739501
H  -4.338108 3.007264 -0.739432
H  4.294853 -2.572216 -1.739168
H  -4.294809 -2.572274 -1.739095
H  4.294846 2.572308 1.739119
H  -4.294816 2.572247 1.739186
