program: Gaussian 09
title: 000019857
version: EM64L-G09RevD.01
frameworkgroup: C1[X(C14H21N3O2)]
method: RPBEPBE
basis: SDD
operation: Freq
keyword: #p
keyword: freq=noraman
keyword: PBEPBE/SDD
title: #p freq=noraman PBEPBE/SDD
converged: YES YES NO NO
title: Mulliken charges:
elementType: O O N N N C C C C C C C C C C C C C C H H H H H H H H H H H H H H H H H H H H H
charge: -0.269506 -0.283131 -0.393080 -0.367286 -0.501764 0.037992 -0.409429 -0.253717 -0.589290 -0.760443 0.165431 0.510087 0.243042 -0.405540 -0.419241 -0.228782 -0.228018 -0.774094 -0.243281 0.190698 0.221534 0.248284 0.290412 0.212530 0.199185 0.238356 0.221659 0.220154 0.331699 0.228065 0.229603 0.330172 0.222288 0.221690 0.252376 0.251787 0.216642 0.226157 0.306684 0.310076
chargesum: 0.00000
title: Mulliken charges with hydrogens summed into heavy atoms:
elementType: O O N N N C C C C C C C C C C C C C C
charge: -0.269506 -0.283131 -0.061381 -0.037114 0.114996 0.228690 0.060389 0.036695 -0.177576 -0.080275 0.165431 0.510087 0.243042 -0.177475 -0.189638 -0.006494 -0.006328 -0.053288 -0.017124
polarizability: 2.12566111e+02 2.55895101e+01 1.54557685e+02 -1.21970823e+01 1.02802027e+01 1.58014211e+02
1716.lowfreq: -11.2756 -0.0004 -0.0002 0.0005 2.6806 3.4538 16.1361 19.7189 33.9899
frequency: 12.6857 19.6897 33.9827 34.6805 56.9468 64.9385 75.8766 81.4429 89.1325 97.4850 132.5728 134.9802 190.2035 199.6016 209.5626 226.5726 253.7587 263.4100 309.2870 312.6420 338.7554 355.7943 402.9375 422.8330 455.7054 502.6581 560.5055 570.1798 582.1876 596.9313 618.0666 621.2712 649.3762 703.9515 706.5699 746.4788 759.3028 766.2632 771.4757 809.7827 850.6174 852.3126 908.1018 920.5837 932.6409 952.0836 973.5984 974.6959 984.4894 989.9429 992.2450 1021.3592 1027.9869 1039.2334 1042.5935 1060.9552 1096.6160 1108.0800 1114.8633 1164.6226 1171.4285 1186.0599 1196.6605 1217.2601 1226.3104 1253.0672 1261.5533 1268.0587 1280.1856 1283.7166 1308.6429 1320.4562 1326.9101 1338.4792 1355.6840 1382.9203 1386.2261 1397.3649 1440.5302 1448.8551 1450.6017 1458.6886 1463.7592 1475.9379 1479.7930 1482.2128 1483.5107 1485.8466 1593.6242 1602.0957 1614.8086 1619.5937 1678.2046 2947.8920 2975.1044 2985.5358 2990.3653 2993.4812 2997.5082 3028.2099 3057.4124 3078.4990 3084.3517 3096.4036 3104.5345 3112.6654 3113.9793 3130.2828 3142.2544 3161.1919 3397.0096 3500.0045 3514.9081 3543.9422
redmass: 4.1079 3.8061 4.4158 5.6778 3.8451 1.7610 4.2327 1.9071 2.2976 3.8256 3.0784 1.3109 2.8230 4.1512 1.2309 4.6692 3.5098 3.0858 4.1519 2.8002 3.0385 4.1945 2.8091 2.5196 3.4562 3.3670 2.1414 2.6675 1.9554 3.7455 6.3480 2.4871 1.4828 1.8945 2.9610 2.2556 1.6309 1.3650 2.9664 3.7350 1.7071 1.8317 2.1332 2.5637 1.5851 1.9042 1.5322 2.3512 1.9830 5.4167 1.3626 2.2297 1.9898 2.4935 1.7137 1.6347 2.3652 3.1867 1.4348 3.1408 1.0537 1.1135 1.6302 2.4736 1.4134 1.9332 1.4735 1.3470 1.2401 1.1740 1.5282 1.5713 1.2532 1.4762 1.3607 7.5068 1.2335 1.2235 2.1696 1.7269 1.0600 1.1200 1.1777 1.4487 1.1631 1.0872 2.0208 1.1863 6.0401 7.7570 6.1963 5.8068 1.0643 1.0821 1.0603 1.0366 1.0602 1.0833 1.0358 1.0986 1.1034 1.0991 1.0987 1.0986 1.1004 1.0870 1.0868 1.0906 1.0958 1.1015 1.0428 1.0772 1.0991 1.0794
irintensity: 0.0103 0.0063 0.1667 0.9052 2.2074 0.2716 11.7680 0.0183 1.6693 2.8781 2.6104 23.2631 11.5177 1.8229 1.3468 4.0872 14.4643 10.1603 7.2809 0.5752 3.5944 16.8687 0.0028 1.8204 17.9370 9.2576 5.6222 85.0116 83.3559 3.5033 0.0765 26.4114 82.8877 34.7087 35.0490 12.7450 95.1719 11.0665 68.7466 0.5712 3.3964 4.6195 7.8534 3.5722 2.4459 2.5333 2.7361 10.2006 4.7718 0.1050 0.2936 2.8379 15.5955 5.8728 7.1709 6.9056 4.1052 0.4349 6.2997 3.8008 0.0535 0.3310 1.7299 0.1535 8.6676 12.2696 27.1503 18.5713 8.8584 2.2245 43.3391 33.3944 0.6290 8.7510 7.4915 0.6132 67.7448 29.4793 6.4434 219.6476 27.7258 17.2281 67.9268 109.7189 32.0576 8.7232 42.8106 17.6357 2.2949 272.8336 10.9937 40.6173 26.7439 25.1872 20.6612 22.7507 28.0811 20.2838 10.6308 4.5769 33.2028 36.5352 35.8660 12.2426 15.5617 9.1871 9.5309 11.2352 46.9549 25.2473 0.7524 58.9215 2.6199 34.7689
temp: 298.150 k
press: 1.00000 atm
elementType: 8 8 7 7 7 6 6 6 6 6 6 6 6 6 6 6 6 6 6 1 1 1 1 1 1 1 1 1 1 1 1 1 1 1 1 1 1 1 1 1
symmnumber: 1
zpe: 877118.0 jmol-1
zpe.correction: 0.334077 hartree
zpe.thermalcorrener: 0.355096 hartree
zpe.thermalcorrenthalpy: 0.356040 hartree
zpe.thermalcorrgfe: 0.280200 hartree
zpe.sumelectzpe: -859.346868 hartree
zpe.sumelectthermal: -859.325849 hartree
zpe.sumelectthermalent: -859.324905 hartree
zpe.sumelectthermalfe: -859.400744 hartree
dipole: -1.1523 -1.5626 1.3247
dipole: 2.3504
quadrupole: -111.8645 -111.9941 -113.5002
quadrupole: 3.6545 1.9629 7.9394
quadrupole: 0.5884 0.4589 -1.0473 3.6545 1.9629 7.9394
hfenergy: -859.6809447 hartree
pointgroup: C01[X(C14H21N3O2)]
dipole: -0.4108212 -0.6654327 0.493491 debye
polarizability: 208.9823737|29.6466687|157.1287614|-11.7679487|9.2742622|159.0268709 unknown
InChI: InChI=1S/C14H21N3O2/c1-10(8-9-12-6-4-3-5-7-12)13(14(19)17-15)16-11(2)18/h3-7,10,13,16-17H,8-9,15H2,1-2H3
charge 0 multiplicity 1
40 atoms
O  -4.239582 -0.436689 0.804525
O  -0.925873 2.286598 -1.28766
N  -2.105128 1.20443 0.402065
N  -3.653893 -1.809023 -0.977555
N  -4.860701 -2.559696 -0.980051
C  -0.892227 -1.032925 0.392164
C  0.505667 -0.406247 0.140354
C  -2.014773 -0.118557 -0.223569
C  1.676223 -1.398317 0.392314
C  -1.144746 -1.32096 1.890382
C  -3.400056 -0.783344 -0.08406
C  3.03439 -0.765687 0.122682
C  -1.594941 2.340627 -0.208941
C  3.593972 -0.771838 -1.18123
C  3.753952 -0.12007 1.161234
C  4.836214 -0.151116 -1.442127
C  4.996726 0.502908 0.90648
C  -1.879839 3.655385 0.509659
C  5.542747 0.489739 -0.397954
H  -0.938325 -1.995791 -0.163875
H  0.631436 0.481638 0.789844
H  0.567125 -0.031191 -0.899199
H  -1.766264 0.049313 -1.291034
H  1.637837 -1.759007 1.437763
H  1.535331 -2.283402 -0.260339
H  -2.139359 -1.768627 2.065648
H  -0.388466 -2.017918 2.291269
H  -1.086993 -0.384955 2.47644
H  -2.781389 1.279716 1.169284
H  3.052568 -1.268582 -1.996559
H  3.338326 -0.110338 2.177054
H  -2.994232 -2.0371 -1.72332
H  5.253273 -0.167849 -2.45564
H  5.539541 0.99406 1.722406
H  -0.923849 4.109105 0.824549
H  -2.354922 4.355746 -0.19818
H  -2.528093 3.540323 1.395153
H  6.507052 0.970427 -0.597861
H  -4.958135 -3.088696 -0.10209
H  -5.669595 -1.936689 -1.116524
