program: Gaussian 09
title: 000249941
version: EM64L-G09RevD.01
frameworkgroup: C1[X(C16H26O2)]
method: RPBEPBE
basis: SDD
operation: Freq
keyword: #pfreq=noraman
keyword: PBEPBE/SDD
title: #p freq=noraman PBEPBE/SDD
converged: YES YES NO NO
title: Mulliken charges:
elementType: O O C C C C C C C C C C C C C C C C H H H H H H H H H H H H H H H H H H H H H H H H H H
charge: -0.300435 -0.447863 -0.561035 -0.027500 -0.594186 -0.026556 0.333812 0.540855 0.178261 -0.561456 -0.381195 -0.455974 -0.711009 -0.688755 -0.703342 -0.707754 -0.273060 -0.342755 0.225661 0.204187 0.198721 0.206082 0.208344 0.200016 0.246028 0.233982 0.233481 0.232804 0.203838 0.211661 0.210100 0.226908 0.194943 0.232162 0.204870 0.210336 0.213339 0.231274 0.202027 0.223242 0.203402 0.204008 0.211547 0.356986
chargesum: 0.00000
title: Mulliken charges with hydrogens summed into heavy atoms:
elementType: O O C C C C C C C C C C C C C C C C
charge: -0.300435 -0.090877 -0.131187 0.171221 -0.179760 0.173460 0.333812 0.540855 0.178261 -0.315429 -0.147213 -0.222492 -0.062707 -0.056804 -0.055975 -0.061113 0.153584 0.072800
polarizability: 2.21920528e+02 3.79786174e-01 1.97169388e+02 1.16381283e+01 3.58654790e+00 1.32078541e+02
1716.lowfreq: -10.4660 -7.1843 -0.0009 -0.0009 -0.0006 7.4125 23.7975 37.2325 48.5659
frequency: 22.3008 37.2264 48.5525 54.7768 64.6573 81.0889 90.2362 99.9383 110.1343 148.8074 196.0633 209.2724 228.7524 230.5809 241.7124 255.0383 258.2804 271.1812 298.6495 319.7087 361.2970 364.7966 370.1130 375.6008 404.0744 422.1426 444.2172 461.6368 480.7765 515.6812 585.0509 598.3042 637.7852 718.6677 725.7720 768.5624 777.9804 807.1274 839.6342 850.7971 859.8600 870.8500 882.7144 888.6547 920.6564 922.8608 943.3091 951.3733 958.4511 960.6458 963.1684 972.2041 998.0630 1048.4296 1070.3149 1081.6943 1089.7232 1091.4835 1093.3641 1131.6213 1159.5549 1181.0953 1184.3289 1189.4246 1211.0881 1218.4145 1225.6722 1234.1997 1252.2277 1267.5240 1275.9984 1295.0136 1327.0251 1330.3954 1332.6652 1345.6616 1349.9440 1363.9581 1370.9481 1377.5177 1381.4569 1389.5862 1390.4710 1395.6162 1410.0931 1457.2957 1458.8205 1461.4418 1463.1894 1463.3813 1465.9103 1470.7994 1475.5868 1480.3033 1483.4636 1486.0272 1490.3611 1502.3525 1581.6537 1614.3945 2956.5352 2956.6049 2960.4406 2965.1700 2968.6938 2970.4201 2971.4020 2973.5174 2978.9644 2986.3063 3029.0681 3031.2635 3047.3048 3056.3774 3061.3015 3063.3767 3066.3203 3069.7715 3070.2233 3076.0152 3076.6583 3080.7392 3119.4768 3143.0841 3150.7914 3541.6747
redmass: 3.3106 3.1851 3.9792 4.0672 3.0364 3.4622 3.7077 3.3318 3.1629 3.2500 3.5149 2.2740 1.1815 1.1871 3.2987 1.0452 1.1066 2.5297 2.9159 3.6091 2.1319 2.0712 1.7238 2.3014 3.3550 1.1492 2.8526 3.0700 2.7245 3.1441 3.6713 3.6631 4.8117 4.5119 2.7973 3.4408 3.0380 2.7292 1.4720 2.3918 1.8928 1.6392 2.1888 1.5198 1.2153 1.2264 1.9037 1.7376 1.5691 1.6123 1.6716 2.1712 2.8383 2.9837 1.9594 1.5886 1.5549 1.6493 1.5948 2.2345 1.6003 1.9031 1.9346 1.2894 1.4353 1.3944 1.2680 1.3425 3.7617 1.4987 1.4986 1.3313 1.5396 1.2184 1.4847 1.3634 1.3875 1.3365 1.2668 1.2337 1.4138 2.6575 1.3517 1.2189 2.7226 1.1035 1.0858 1.0867 1.0966 1.0663 1.0441 1.0558 1.0565 1.0561 1.0513 1.0548 1.0553 2.8271 6.8509 6.7931 1.0775 1.0784 1.0556 1.0362 1.0355 1.0375 1.0403 1.0684 1.0612 1.0641 1.1021 1.1053 1.0999 1.0987 1.0997 1.0986 1.0987 1.0999 1.1003 1.0991 1.0993 1.0968 1.0870 1.0954 1.0911 1.0657
irintensity: 0.0652 0.0570 0.3660 1.5151 0.4506 1.1796 0.0956 0.3572 2.5894 3.1166 3.0157 1.9355 0.0702 0.3260 0.2310 0.2878 0.4852 1.7802 2.6773 0.0477 0.8127 1.6024 0.3804 0.0798 0.1981 144.2532 11.0849 12.4937 3.8718 3.7850 5.1297 4.0575 5.4345 5.5410 8.7633 5.8390 2.5569 3.0805 32.7702 13.9046 2.4825 3.4622 28.5559 0.8205 7.1984 0.3654 8.5634 3.2377 0.3632 2.2276 0.6811 8.2408 96.3866 40.2262 4.7759 4.8984 1.5151 16.8532 3.4889 95.8636 7.4697 8.0755 22.5785 8.8458 0.8610 20.7902 6.9705 1.5141 90.5886 18.1769 16.1759 0.8595 0.7892 6.4033 1.0676 19.8783 1.0963 1.8381 15.5627 16.3599 18.1255 13.7304 20.5710 12.8596 61.0188 19.1469 10.2165 4.3764 4.2958 2.4089 4.2179 1.4240 0.0851 25.8095 17.2544 22.3478 17.6172 40.7334 31.4646 29.0288 32.3426 15.6418 38.2759 57.8428 43.7475 17.3112 36.9611 49.6143 58.0196 51.6020 20.7544 48.5159 5.1087 56.2773 24.7698 61.5079 62.4727 6.7071 6.2124 152.4992 44.3268 33.7261 12.3815 29.8912 4.0881 28.8713
temp: 298.150 k
press: 1.00000 atm
elementType: 8 8 6 6 6 6 6 6 6 6 6 6 6 6 6 6 6 6 1 1 1 1 1 1 1 1 1 1 1 1 1 1 1 1 1 1 1 1 1 1 1 1 1 1
symmnumber: 1
zpe: 1008827.5 jmol-1
zpe.correction: 0.384242 hartree
zpe.thermalcorrener: 0.404979 hartree
zpe.thermalcorrenthalpy: 0.405923 hartree
zpe.thermalcorrgfe: 0.334002 hartree
zpe.sumelectzpe: -774.315033 hartree
zpe.sumelectthermal: -774.294296 hartree
zpe.sumelectthermalent: -774.293352 hartree
zpe.sumelectthermalfe: -774.365273 hartree
dipole: 2.1937 -0.3595 -0.6684
dipole: 2.3212
quadrupole: -115.0478 -108.1997 -113.9247
quadrupole: 9.7703 5.9436 -2.3133
quadrupole: -2.6571 4.1911 -1.5340 9.7703 5.9436 -2.3133
hfenergy: -774.6992754 hartree
pointgroup: C01 [X(C16H26O2)]
dipole: 0.8583736 0.1054021 0.2934323 debye
polarizability: 222.4890228|-0.7988775|196.7644919|-8.8794074|6.6328671|131.9149422 unknown
InChI: InChI=1S/C16H26O2/c1-12(2)9-14-5-6-15(10-13(3)4)16(11-14)18-8-7-17/h5-6,11-13,17H,7-10H2,1-4H3
charge 0 multiplicity 1
44 atoms
O  -1.415393 -1.242744 0.349734
O  -3.525411 -2.909386 -0.715855
C  -2.017276 1.393168 1.257764
C  -3.099276 2.003252 0.30194
C  3.230618 0.008883 -1.142976
C  4.310373 -0.497259 -0.124743
C  -0.683007 1.032379 0.618982
C  1.878014 0.369238 -0.542744
C  -0.3881 -0.289403 0.171932
C  0.866044 -0.614451 -0.397664
C  0.342775 1.996389 0.47046
C  1.595774 1.685165 -0.102752
C  -2.634697 3.324533 -0.354286
C  -3.576182 0.996827 -0.771002
C  4.677859 0.580859 0.921052
C  3.896472 -1.817887 0.565244
C  -1.157783 -2.638293 -0.04896
C  -2.473453 -3.377373 0.188701
H  -2.44886 0.49322 1.733392
H  -1.831196 2.132302 2.062086
H  -3.969477 2.238766 0.951706
H  3.096252 -0.777645 -1.912188
H  3.646545 0.895387 -1.66094
H  5.218069 -0.70397 -0.731355
H  1.074856 -1.634008 -0.736754
H  0.149414 3.017284 0.820834
H  2.358441 2.46537 -0.20626
H  -1.780008 3.152041 -1.033286
H  -2.321247 4.064709 0.406642
H  -3.454031 3.773334 -0.946491
H  -4.354242 1.448225 -1.414578
H  -2.737685 0.679858 -1.41766
H  -4.010365 0.096482 -0.295212
H  3.807724 0.828982 1.556023
H  5.020097 1.513945 0.434276
H  5.490669 0.22428 1.581041
H  4.710331 -2.189009 1.215741
H  2.999826 -1.670657 1.194612
H  3.669188 -2.607233 -0.176785
H  -0.887234 -2.682102 -1.122868
H  -0.334024 -3.064657 0.560594
H  -2.774961 -3.262883 1.250877
H  -2.347569 -4.450257 -0.03482
H  -3.584066 -1.92266 -0.626153
