program: Gaussian 09
title: 000249956
version: EM64L-G09RevD.01
frameworkgroup: C1[X(C20H33ClO3)]
method: RPBEPBE
basis: SDD
operation: Freq
keyword: #p
keyword: freq=noraman
keyword: PBEPBE/SDD
title: #p freq=noraman PBEPBE/SDD
converged: YES YES NO NO
title: Mulliken charges:
elementType: Cl O O O C C C C C C C C C C C C C C C C C C C C H H H H H H H H H H H H H H H H H H H H H H H H H H H H H H H H H
charge: -0.082447 -0.291162 -0.310057 -0.271239 -0.549755 -0.031106 -0.569719 -0.037711 0.328372 0.545845 0.184574 -0.556128 -0.382823 -0.496004 -0.710916 -0.693707 -0.708628 -0.698086 -0.316332 -0.262798 -0.219915 -0.315588 -0.213244 -0.557839 0.231576 0.196984 0.204352 0.205004 0.200176 0.206544 0.264258 0.231915 0.232242 0.214725 0.210153 0.209981 0.204505 0.221699 0.208951 0.207871 0.214632 0.212495 0.205349 0.229707 0.202933 0.221152 0.218714 0.212489 0.207014 0.221456 0.217458 0.216565 0.197681 0.262226 0.201579 0.246950 0.277072
chargesum: 0.00000
title: Mulliken charges with hydrogens summed into heavy atoms:
elementType: Cl O O O C C C C C C C C C C C C C C C C C C C C
charge: -0.082447 -0.291162 -0.310057 -0.271239 -0.121195 0.173246 -0.164539 0.168832 0.328372 0.545845 0.184574 -0.291870 -0.150908 -0.263762 -0.076057 -0.058552 -0.073630 -0.060097 0.123534 0.156705 0.218999 0.098659 0.250562 -0.033817
polarizability: 2.54147254e+02 1.23205537e+01 2.73945669e+02 1.57128742e+01 -6.89260237e+00 1.87000683e+02
1716.lowfreq: -26.2657 -7.2131 0.0012 0.0013 0.0019 4.2538 9.0349 18.4002 19.6554
frequency: -24.2279 17.9237 19.0488 26.5323 32.6373 34.8685 41.8858 51.3817 53.5730 69.7756 72.9067 83.1108 105.8484 119.0533 123.4498 166.1871 184.1845 205.9589 209.9249 215.5180 231.9595 239.4417 241.7969 259.9572 274.7221 281.8408 304.4227 311.9781 326.3331 332.6355 335.3728 362.7676 377.7835 404.9887 413.4395 432.1947 438.6663 454.0747 469.4619 507.7208 522.5181 550.0374 559.0304 592.6196 633.8045 711.0300 719.1483 739.6206 771.0817 794.9378 799.4839 815.4815 841.4099 852.9008 874.5785 877.4058 883.5429 896.7221 900.1149 916.4886 917.5741 931.2143 937.4917 946.9706 952.0273 958.9764 959.6371 963.3699 979.8238 1009.3240 1032.1995 1035.9610 1060.7005 1067.2337 1090.8053 1096.6849 1106.1573 1117.4479 1127.5971 1129.7138 1132.0326 1157.1364 1173.9758 1174.9189 1176.9213 1209.0508 1210.8584 1218.6601 1224.3372 1227.0606 1234.9997 1247.1268 1271.5469 1277.5348 1282.2179 1282.3225 1291.7466 1294.7155 1326.1568 1331.1368 1332.1411 1335.4340 1347.4594 1354.4475 1360.0981 1374.4356 1377.0755 1377.2007 1381.8106 1385.1298 1391.7036 1394.1257 1409.9738 1428.8363 1439.4087 1442.1259 1451.4212 1456.8299 1459.6245 1461.1066 1463.7377 1466.4507 1467.2579 1471.8852 1473.2116 1479.9397 1480.5393 1486.6191 1486.7396 1502.6749 1582.7022 1614.2009 2919.3958 2957.8263 2958.0080 2958.2657 2962.2769 2963.9828 2965.4081 2965.6716 2969.0693 2972.6993 2976.9052 2979.2162 2992.1221 3021.0325 3026.6654 3044.6603 3047.0205 3053.2905 3056.3774 3059.6771 3060.1450 3060.5445 3063.4985 3065.8460 3067.8333 3068.1237 3070.3352 3073.3801 3073.9161 3110.3644 3134.1687 3139.3267 3144.9367
redmass: 4.1588 4.2212 7.9274 3.5175 7.0058 3.6496 3.1973 2.9362 3.0872 3.4450 3.5942 3.8576 4.0184 4.0191 4.6555 3.9673 3.6476 1.1877 1.0705 2.3228 1.3298 1.5955 1.8027 2.3072 2.2214 2.3798 2.9633 2.3312 2.6856 2.9857 2.4312 2.5569 2.2580 2.0095 1.9963 2.9749 2.9913 2.8506 2.9398 3.0739 2.2150 4.3743 4.4557 5.0459 4.3941 4.5328 3.8604 2.8884 2.9121 2.1525 3.1223 2.7676 1.7149 3.1097 1.5486 2.0079 1.4443 2.2752 1.4907 1.2122 1.1861 2.2598 1.9721 1.6824 1.4866 1.5575 1.5532 2.1128 1.8562 2.5658 2.9509 2.5267 2.5794 1.6960 2.8117 1.5656 2.8752 2.7435 2.3509 2.4007 2.3662 1.5038 1.2275 1.8595 1.8403 1.1282 1.6302 1.1683 1.3838 1.5559 1.3327 2.0003 1.1180 1.1641 1.4150 1.3527 1.3960 1.1858 1.4385 1.5518 1.4598 1.4142 1.2358 1.2639 1.2703 1.2158 1.3274 1.2186 1.2980 4.7082 1.2447 1.2390 2.6391 1.1097 1.0864 1.0912 1.0903 1.0809 1.0790 1.0832 1.0913 1.0453 1.0486 1.0719 1.0697 1.0551 1.0500 1.0512 1.0508 2.9346 6.9428 6.6478 1.0667 1.0762 1.0787 1.0630 1.0615 1.0646 1.0356 1.0375 1.0384 1.0363 1.0579 1.0617 1.0595 1.1009 1.1051 1.1038 1.0910 1.0985 1.0993 1.1058 1.0992 1.0611 1.0990 1.0999 1.0986 1.0978 1.0991 1.0992 1.0988 1.0873 1.0913 1.0951 1.1100
irintensity: 1.0320 0.0075 2.0818 0.2472 1.7593 0.4801 0.1143 0.0984 0.0997 0.5452 0.7831 0.8995 0.6318 6.1761 2.5687 2.2025 13.8107 0.3471 0.1975 0.3361 0.4082 0.6979 1.0879 3.1850 2.5528 1.3185 0.7841 2.1284 6.4929 1.7389 7.0126 6.7661 0.2902 0.0490 0.1543 8.6024 2.3365 9.5012 6.6071 0.6438 13.5467 6.3950 3.4340 23.8459 9.3592 6.3012 0.5957 3.0490 8.1562 19.5044 1.6900 3.9040 10.2032 17.5905 0.5425 8.0866 2.0039 45.0044 21.4821 6.0831 6.5866 22.8239 19.0347 2.2559 1.0078 0.7158 1.1776 4.6240 18.8669 12.9846 56.8405 27.2771 44.9747 4.7645 39.7105 0.6585 49.5125 60.9446 44.3563 5.9665 50.7739 3.8897 0.3989 16.8806 15.3472 0.7761 5.6019 0.3362 2.9326 2.9279 6.5332 60.9232 1.1619 31.2682 22.4872 2.1312 1.8375 14.8266 7.1737 3.3783 1.1321 3.5372 6.9055 17.6871 0.5422 17.7147 3.3303 16.9130 2.2086 7.4166 10.9327 22.8208 34.7107 10.4759 7.6428 9.1359 4.6755 10.8803 0.9359 2.4080 9.2103 1.3031 0.8123 10.1666 8.4889 8.0621 10.2029 20.6237 20.7848 54.2909 32.4134 26.5820 78.8441 21.6265 21.5875 23.2023 59.7380 47.9371 51.1068 27.1703 44.5464 32.6907 25.6506 40.2760 64.2140 21.5277 41.6498 37.4677 6.1778 2.5381 7.6037 23.8417 33.9483 27.7269 68.7788 19.9439 30.8102 41.2793 86.3233 74.6011 35.8052 16.2109 13.0941 14.2769 10.6177
temp: 298.150 k
press: 1.00000 atm
elementType: 17 8 8 8 6 6 6 6 6 6 6 6 6 6 6 6 6 6 6 6 6 6 6 6 1 1 1 1 1 1 1 1 1 1 1 1 1 1 1 1 1 1 1 1 1 1 1 1 1 1 1 1 1 1 1 1 1
symmnumber: 1
zpe: 1287008.3 jmol-1
zpe.correction: 0.490196 hartree
zpe.thermalcorrener: 0.517871 hartree
zpe.thermalcorrenthalpy: 0.518815 hartree
zpe.thermalcorrgfe: 0.428343 hartree
zpe.sumelectzpe: -1465.711158 hartree
zpe.sumelectthermal: -1465.683483 hartree
zpe.sumelectthermalent: -1465.682539 hartree
zpe.sumelectthermalfe: -1465.773011 hartree
dipole: 0.4967 1.9299 1.2326
dipole: 2.3432
quadrupole: -148.8868 -154.7472 -153.2364
quadrupole: 8.2100 7.8020 -2.2773
quadrupole: 3.4033 -2.4571 -0.9463 8.2100 7.8020 -2.2773
hfenergy: -1466.201354 hartree
pointgroup: C01 [X(C20H33Cl1O3)]
dipole: 0.4863096 0.7169991 -0.3151012 debye
polarizability: 247.6475149|7.8041886|275.017873|25.0341327|8.0852038|192.4282179 unknown
InChI: InChI=1S/C20H33ClO3/c1-16(2)13-18-5-6-19(14-17(3)4)20(15-18)24-12-11-23-10-9-22-8-7-21/h5-6,15-17H,7-14H2,1-4H3
charge 0 multiplicity 1
57 atoms
Cl -5.214991 2.390207 -0.480362
O  -0.565699 -1.246771 -1.774507
O  -1.459503 1.638116 -0.899007
O  -2.74913 2.943576 1.637292
C  0.392187 -3.771912 -0.881914
C  -0.331276 -4.268675 0.410765
C  3.463715 1.222873 -0.028317
C  2.74082 2.255692 0.890638
C  1.181755 -2.487311 -0.689622
C  2.688327 -0.067243 -0.263151
C  0.696565 -1.223229 -1.136437
C  1.431662 -0.034118 -0.920555
C  2.437275 -2.498415 -0.038365
C  3.186291 -1.318451 0.17228
C  -0.970029 -5.65453 0.15974
C  -1.387626 -3.255842 0.907987
C  3.543957 3.575797 0.945817
C  2.506634 1.689231 2.309698
C  -0.971037 -0.121635 -2.635825
C  -2.002967 0.799678 -1.974424
C  -1.585058 1.063167 0.457669
C  -1.493275 2.201496 1.474372
C  -3.055885 3.897583 0.564927
C  -4.563011 3.948221 0.381678
H  -0.363901 -3.630757 -1.67518
H  1.081572 -4.573178 -1.216263
H  0.439966 -4.379023 1.202978
H  3.669286 1.716675 -1.000486
H  4.448816 0.985287 0.420744
H  1.750343 2.473597 0.437001
H  1.013366 0.930116 -1.231245
H  2.838512 -3.461731 0.301489
H  4.157979 -1.369105 0.677226
H  -1.46199 -6.038018 1.073018
H  -0.213474 -6.396912 -0.158047
H  -1.737912 -5.592069 -0.63558
H  -1.875734 -3.618993 1.831839
H  -0.930911 -2.272991 1.123711
H  -2.169316 -3.10138 0.140464
H  4.549193 3.404181 1.377404
H  3.032917 4.328268 1.574813
H  3.678947 4.008865 -0.063419
H  1.959778 2.414405 2.941357
H  1.9261 0.749663 2.276896
H  3.472871 1.471901 2.805663
H  -1.444224 -0.594735 -3.518167
H  -0.087982 0.450263 -2.976523
H  -2.377003 1.503349 -2.74315
H  -2.86204 0.205957 -1.602496
H  -0.770325 0.331442 0.634352
H  -2.563664 0.552623 0.563992
H  -1.295959 1.777488 2.474885
H  -0.654359 2.878334 1.205535
H  -2.546826 3.617846 -0.374957
H  -2.718269 4.91414 0.87349
H  -4.868083 4.785801 -0.264629
H  -5.086581 3.981581 1.348406
