program: Gaussian 09
title: 000249935
version: EM64L-G09RevD.01
frameworkgroup: C1[X(C15H25NO2S)]
method: RPBEPBE
basis: SDD
operation: Freq
keyword: #p
keyword: freq=noraman
keyword: PBEPBE/SDD
title: #p freq=noraman PBEPBE/SDD
converged: YES YES NO NO
title: Mulliken charges:
elementType: S O O N C C C C C C C C C C C C C C C H H H H H H H H H H H H H H H H H H H H H H H H H
charge: 0.926159 -0.537229 -0.538802 -0.317901 -0.376684 -0.572543 -0.334509 0.524312 -0.041072 -0.341238 -0.342373 -0.358755 -0.395488 -0.402617 -0.240699 -0.278948 -0.656026 -0.656439 -0.692575 0.208425 0.207714 0.212604 0.212137 0.189624 0.189711 0.217230 0.258057 0.233171 0.232485 0.197222 0.197223 0.244757 0.245625 0.275207 0.294026 0.212737 0.257684 0.223755 0.209959 0.209332 0.265569 0.210559 0.217984 0.210627
chargesum: 0.00000
title: Mulliken charges with hydrogens summed into heavy atoms:
elementType: S O O N C C C C C C C C C C C C C C C
charge: 0.926159 -0.537229 -0.538802 -0.317901 0.039456 -0.147802 0.044827 0.524312 -0.041072 0.134049 0.123283 0.035691 -0.150731 -0.156992 0.034509 0.015078 0.038151 0.028420 -0.053406
polarizability: 2.80158732e+02 9.11967476e+00 1.64512703e+02 -7.99737428e+00 5.86328616e+00 1.78356333e+02
1716.lowfreq: -8.4181 -5.4551 -0.0023 -0.0014 -0.0012 10.3755 19.5456 23.7949 36.7559
frequency: 18.9919 23.5719 36.6239 42.5337 49.0920 57.7290 83.0010 93.4262 109.7741 121.2485 128.0320 138.8583 158.2505 160.1990 180.6183 215.7840 223.7182 236.8973 249.6886 257.1479 267.5768 300.6961 310.1998 342.0055 367.0349 383.9103 398.0262 406.5121 413.5480 446.1843 471.5523 538.2839 572.9356 621.9782 629.6742 727.0807 727.7314 740.7420 756.0780 758.4806 788.0450 800.1811 818.7969 835.8666 841.4619 859.4292 896.5942 900.6588 923.3374 953.4353 961.4499 983.7395 995.7206 999.8572 1004.3317 1042.9678 1053.1360 1057.3536 1070.0956 1073.5190 1074.0650 1084.2373 1109.2516 1122.4408 1160.4445 1181.0549 1182.2541 1196.8060 1213.8191 1240.5788 1254.4206 1274.8957 1284.1791 1288.8093 1299.4002 1301.4319 1301.6301 1337.2457 1345.4281 1353.7243 1354.0223 1386.7774 1387.1983 1388.3494 1394.4830 1397.4430 1437.9602 1450.6544 1464.5558 1465.8379 1466.7194 1471.6952 1472.6548 1475.0801 1475.8234 1483.5890 1485.6036 1489.6444 1493.6386 1593.1536 1593.7490 2954.2328 2966.5206 2972.4594 2973.3061 2975.5335 2984.7588 2986.8823 2990.3084 2992.7266 2993.8143 3014.5316 3028.5580 3030.4590 3051.8548 3060.3591 3070.0707 3073.1266 3079.0002 3082.4983 3105.4250 3115.6049 3130.6191 3133.0483 3157.1576 3165.9219
redmass: 4.1551 4.0594 3.5735 3.1976 1.7725 3.3359 2.3723 2.4674 2.6046 2.8090 2.5138 3.2416 4.5291 3.3029 1.8621 3.2543 1.1317 2.8320 2.0652 3.5248 2.0611 3.7711 3.5772 3.6903 2.8926 3.2529 3.5780 2.8868 3.9900 4.1064 5.0719 3.0269 3.7539 6.8616 5.1928 3.6175 1.0704 1.9352 1.1257 1.2320 7.0927 4.5738 1.5391 1.2522 1.4212 1.4216 1.8729 2.2391 12.7857 1.2336 1.3981 1.3912 4.8985 3.6030 3.0729 3.3088 2.4355 1.9095 1.3657 1.8115 2.2494 1.7646 2.3326 1.2610 1.8237 1.1386 3.1429 1.5901 2.4967 1.3321 1.2920 1.2456 1.0961 1.1171 1.2395 1.3826 1.1489 1.4202 1.2059 1.6142 1.1770 1.2749 5.2759 1.2160 1.1951 2.7338 1.0750 1.0723 1.0933 1.1077 1.0442 1.9018 1.0465 1.1422 1.0474 1.0829 1.0469 1.0975 1.0497 6.2180 7.3092 1.0590 1.0592 1.0535 1.0418 1.0600 1.0592 1.0370 1.0476 1.0530 1.0984 1.1014 1.1010 1.1037 1.1047 1.0991 1.1009 1.0993 1.0984 1.0979 1.1022 1.1000 1.0891 1.0895 1.0954 1.0959
irintensity: 1.0176 0.5423 0.1240 1.1441 0.1015 0.6976 0.4225 0.1473 0.5407 1.2340 0.7153 0.7368 2.5099 1.3381 1.1241 1.7490 0.0100 2.3386 8.5971 10.0018 4.8368 2.1744 2.7945 6.0024 2.5664 1.1876 19.1289 0.1551 7.2368 10.4972 50.2093 34.1964 96.3715 0.6413 70.3182 2.6180 9.6677 38.4170 0.1192 5.8506 46.3256 51.2510 0.5034 1.8416 14.8611 22.7118 2.3236 6.8439 74.8065 0.1361 0.2213 0.3631 3.1386 2.8468 39.0359 0.4401 30.9505 4.0978 0.3227 5.1553 1.1586 6.6949 24.5533 7.7455 1.1961 9.8746 45.5102 0.0069 4.0525 8.7341 0.0216 16.9712 0.6893 0.3099 2.1331 2.5302 17.5641 1.2234 3.9477 0.9188 7.6834 13.0688 8.3792 10.3809 45.6245 10.3817 11.5958 8.2934 0.3736 2.3543 3.7573 15.9824 16.7328 10.5216 12.2760 0.7244 9.4441 23.9140 9.6543 13.5052 1.4050 10.7089 7.0256 64.7064 24.5595 20.6439 79.6230 27.2356 31.0894 26.7749 0.8377 1.3610 9.6796 14.0738 53.6187 4.2923 92.8469 50.2257 59.7666 14.5032 14.6916 26.2807 12.7507 9.8033 6.4712 4.4319
temp: 298.150 k
press: 1.00000 atm
elementType: 16 8 8 7 6 6 6 6 6 6 6 6 6 6 6 6 6 6 6 1 1 1 1 1 1 1 1 1 1 1 1 1 1 1 1 1 1 1 1 1 1 1 1 1
symmnumber: 1
zpe: 974651.0 jmol-1
zpe.correction: 0.371225 hartree
zpe.thermalcorrener: 0.394183 hartree
zpe.thermalcorrenthalpy: 0.395127 hartree
zpe.thermalcorrgfe: 0.316419 hartree
zpe.sumelectzpe: -1188.183351 hartree
zpe.sumelectthermal: -1188.160393 hartree
zpe.sumelectthermalent: -1188.159449 hartree
zpe.sumelectthermalfe: -1188.238156 hartree
dipole: -4.6638 3.8499 -1.3207
dipole: 6.1901
quadrupole: -123.6273 -128.5773 -123.1676
quadrupole: 17.7920 -7.6146 0.9409
quadrupole: 1.4967 -3.4532 1.9565 17.7920 -7.6146 0.9409
hfenergy: -1188.5545756 hartree
pointgroup: C01 [X(C15H25N1O2S1)]
dipole: -1.9263793 -1.4706965 -0.2390916 debye
polarizability: 276.8390345|-19.1977568|164.4778286|11.5571883|-2.390629|181.7109055 unknown
InChI: InChI=1S/C15H25NO2S/c1-4-7-8-9-14-10-12-15(13-11-14)19(17,18)16(5-2)6-3/h10-13H,4-9H2,1-3H3
charge 0 multiplicity 1
44 atoms
S  2.819077 0.408526 0.403193
O  3.437642 0.918812 -1.027428
O  3.355637 1.042948 1.805766
N  2.924555 -1.442856 0.650233
C  -4.071994 -0.031746 -0.242417
C  -3.312771 1.296363 0.041427
C  -5.601954 0.163417 -0.321684
C  -1.809194 1.097122 0.132725
C  0.950675 0.642566 0.291711
C  4.096452 -1.830435 1.488287
C  2.577801 -2.214981 -0.574324
C  -6.365843 -1.14824 -0.616332
C  -1.200793 0.754127 1.370912
C  -0.988913 1.217303 -1.019815
C  0.188543 0.525243 1.465505
C  0.404669 0.993488 -0.952322
C  5.515324 -1.459459 0.99382
C  3.625344 -2.342882 -1.706675
C  -7.89501 -0.947883 -0.69008
H  -3.829896 -0.765981 0.552431
H  -3.70044 -0.466508 -1.192297
H  -3.553369 2.019153 -0.762201
H  -3.697782 1.726114 0.986769
H  -5.96899 0.593958 0.633578
H  -5.838548 0.909243 -1.109401
H  3.997473 -2.927954 1.60816
H  3.937818 -1.375547 2.481789
H  1.650358 -1.76601 -0.980422
H  2.292407 -3.220337 -0.204056
H  -6.000337 -1.575177 -1.572402
H  -6.126293 -1.894098 0.168767
H  -1.82075 0.674847 2.271723
H  -1.442157 1.498399 -1.977705
H  0.667331 0.280807 2.418617
H  1.059238 1.110343 -1.822609
H  6.258002 -1.813127 1.733431
H  5.621011 -0.363642 0.913471
H  5.759133 -1.908027 0.017938
H  3.157954 -2.841735 -2.576603
H  4.492531 -2.952102 -1.39985
H  3.978168 -1.346862 -2.023205
H  -8.16248 -0.228373 -1.486848
H  -8.417947 -1.898058 -0.903565
H  -8.289779 -0.552162 0.264692
