program: Gaussian 09
title: 000249921
version: EM64L-G09RevD.01
frameworkgroup: C1[X(C13H12O2)]
method: RPBEPBE
basis: SDD
operation: Freq
keyword: #pfreq=noraman
keyword: PBEPBE/SDD
title: #p freq=noraman PBEPBE/SDD
converged: YES YES NO NO
title: Mulliken charges:
elementType: O O C C C C C C C C C C C C C H H H H H H H H H H H H
charge: -0.263215 -0.233233 0.274241 0.187813 0.188586 0.169872 -0.385408 -0.363418 -0.389888 -0.397379 0.084272 -0.263825 -0.235674 -0.792718 -0.531242 0.274730 0.247971 0.275407 0.246036 0.228491 0.232165 0.247924 0.258830 0.235820 0.247596 0.228609 0.227640
chargesum: 0.00000
title: Mulliken charges with hydrogens summed into heavy atoms:
elementType: O O C C C C C C C C C C C C C
charge: -0.263215 -0.233233 0.274241 0.187813 0.188586 0.169872 -0.110678 -0.115447 -0.114482 -0.151343 0.084272 -0.035334 -0.003508 -0.050143 0.172602
polarizability: 2.06289744e+02 1.19867796e+00 1.89384454e+02 2.61573065e+00 1.43284888e+00 6.97296590e+01
1716.lowfreq: -4.6670 0.0006 0.0006 0.0007 5.4761 8.0851 54.7389 77.5300 93.1084
frequency: 54.6963 77.5292 93.0989 136.2083 179.4751 192.6819 210.3780 214.3162 233.8387 289.2879 318.8459 347.4194 394.3283 422.4890 462.2287 470.5964 498.0198 550.3319 583.0393 598.4925 634.9971 657.3304 666.8478 698.6062 778.1491 784.2545 801.3035 832.9853 885.1268 919.8809 959.4920 966.6553 973.0123 987.9829 998.7572 1020.6218 1036.7813 1074.8959 1110.1056 1114.2680 1151.9668 1161.0620 1180.5518 1202.9564 1246.5799 1255.9881 1291.6693 1359.3531 1373.9616 1384.6486 1411.6343 1435.0081 1438.8225 1451.5847 1459.5776 1464.8250 1468.6523 1474.2317 1522.7486 1547.2782 1579.8075 1595.6405 1626.7209 2970.1304 2984.5462 3062.7165 3077.3388 3115.0264 3131.6715 3131.9771 3148.8765 3151.5451 3171.5867 3176.5476 3195.1218
redmass: 3.4911 5.0825 3.2387 3.6457 3.6747 4.0312 3.4964 1.1372 1.2250 3.4403 5.2775 5.7386 4.4053 3.1743 5.9941 3.4040 4.5645 3.7846 4.9590 4.2424 2.6637 4.0977 4.2197 5.6339 1.3949 5.1248 2.9627 1.4540 1.6564 5.6447 2.3108 1.5802 1.5046 2.4608 1.3405 1.7778 2.4157 3.5025 2.4002 1.2592 1.4709 1.5417 1.1193 1.4178 1.9734 2.7992 2.1344 4.8879 1.2190 2.2093 8.4415 1.4569 1.9695 1.3215 1.4932 1.1312 1.0507 1.1127 3.9156 6.9495 6.1533 7.4472 6.6328 1.0324 1.0386 1.1043 1.0933 1.1018 1.0873 1.0998 1.0885 1.0922 1.0945 1.0961 1.0930
irintensity: 4.5680 1.2519 5.1179 6.6131 5.5966 0.4466 1.2509 0.6136 1.3250 3.2864 0.5255 0.3012 5.0103 4.9838 3.7857 0.7380 7.0347 11.0448 19.0211 1.2779 1.6577 1.7656 2.1272 13.1703 90.7182 0.3121 0.6729 46.9941 0.2744 7.5110 3.7208 17.9882 3.9075 24.2779 1.8894 3.0363 13.9686 102.6490 13.4137 0.1384 0.7200 4.9622 0.2931 18.4409 83.4611 327.2297 66.3147 34.3211 57.6554 10.0249 2.3090 6.2473 10.7914 38.3784 42.8010 21.4186 15.8867 27.3717 68.0894 179.5524 125.1285 45.9444 10.3267 68.1110 4.0904 39.4520 12.8904 15.3849 3.4377 22.6606 0.7132 18.2319 13.8740 11.8393 13.2517
temp: 298.150 k
press: 1.00000 atm
elementType: 8 8 6 6 6 6 6 6 6 6 6 6 6 6 6 1 1 1 1 1 1 1 1 1 1 1 1
symmnumber: 1
zpe: 560042.0 jmol-1
zpe.correction: 0.213309 hartree
zpe.thermalcorrener: 0.226446 hartree
zpe.thermalcorrenthalpy: 0.227390 hartree
zpe.thermalcorrgfe: 0.173802 hartree
zpe.sumelectzpe: -651.961772 hartree
zpe.sumelectthermal: -651.948635 hartree
zpe.sumelectthermalent: -651.947690 hartree
zpe.sumelectthermalfe: -652.001278 hartree
dipole: 3.4913 1.1844 1.1356
dipole: 3.8577
quadrupole: -78.9112 -81.2981 -91.9825
quadrupole: -17.9004 -3.4777 -3.2599
quadrupole: 5.1528 2.7658 -7.9186 -17.9004 -3.4777 -3.2599
hfenergy: -652.1750804 hartree
pointgroup: C01 [X(C13H12O2)]
dipole: -1.4118088 -0.3779132 0.4092356 debye
polarizability: 206.4228796|0.12333|189.3096956|0.7725623|-0.6860896|69.6712819 unknown
InChI: InChI=1S/C13H12O2/c1-9(14)10-7-8-13(15-2)12-6-4-3-5-11(10)12/h3-8H,1-2H3
charge 0 multiplicity 1
27 atoms
O  -3.0662 0.718062 0.277738
O  3.227733 1.982442 -0.166255
C  0.463105 -0.501117 0.182242
C  -0.987917 -0.474286 0.211734
C  1.191873 0.756265 0.194559
C  -1.67346 0.797751 0.228836
C  0.462345 1.959601 0.164801
C  1.088507 -1.78988 0.07719
C  -1.734702 -1.694959 0.197293
C  -0.954293 1.999951 0.185693
C  2.684205 0.926035 0.284646
C  0.339591 -2.97015 0.055825
C  -1.084225 -2.928558 0.130639
C  3.565267 -0.097499 1.003963
C  -3.827708 1.972117 0.273609
H  1.032907 2.893951 0.143791
H  2.173448 -1.857032 -0.017125
H  -2.825795 -1.634742 0.227389
H  -1.461962 2.968104 0.183954
H  0.851546 -3.935092 -0.030036
H  -1.661793 -3.85891 0.11766
H  3.014877 -0.705883 1.739389
H  4.376055 0.456005 1.506474
H  4.046239 -0.774514 0.271667
H  -4.882669 1.665437 0.315277
H  -3.639368 2.548229 -0.652012
H  -3.580404 2.590472 1.157259
