program: Gaussian 09
title: 000249922
version: EM64L-G09RevD.01
frameworkgroup: C1[X(C13H16Cl2O)]
method: RPBEPBE
basis: SDD
operation: Freq
keyword: #p
keyword: freq=noraman
keyword: PBEPBE/SDD
title: #p freq=noraman PBEPBE/SDD
converged: YES YES NO NO
title: Mulliken charges:
elementType: Cl Cl O C C C C C C C C C C C C C H H H H H H H H H H H H H H H H
charge: -0.032494 -0.058762 -0.272610 -0.195655 -0.442935 -0.440861 -0.397498 -0.400073 -0.386211 0.491028 0.171141 -0.364472 -0.243584 -0.137237 -0.270407 -0.516911 0.243926 0.206877 0.200060 0.194176 0.222863 0.194396 0.202959 0.203683 0.197622 0.189873 0.202775 0.264754 0.281691 0.235341 0.216801 0.239743
chargesum: 0.00000
title: Mulliken charges with hydrogens summed into heavy atoms:
elementType: Cl Cl O C C C C C C C C C C C C C
charge: -0.032494 -0.058762 -0.272610 0.048271 -0.035998 -0.023822 -0.000142 0.001232 0.006436 0.491028 0.171141 -0.099718 -0.243584 -0.137237 0.011285 0.174973
polarizability: 1.97321373e+02 4.80806279e-01 1.84918855e+02 1.48428515e+00 -1.41583197e+00 1.02215274e+02
1716.lowfreq: -21.5744 0.0003 0.0014 0.0018 5.6815 11.8099 18.8405 60.4571 64.6033
frequency: 7.8051 60.4297 64.5901 81.1846 89.2413 149.1292 161.4342 164.8444 176.4976 205.2861 219.0341 242.7824 271.0431 274.0635 328.9474 346.3530 388.8057 423.6886 426.2657 436.3174 479.1166 557.3867 564.4125 566.8941 611.0405 683.9408 759.2521 776.1632 783.7796 795.3472 839.0564 853.9659 872.4611 874.7022 894.8664 912.5466 921.7529 948.8932 998.4161 1047.9587 1053.4099 1071.3821 1073.1821 1110.6197 1111.1998 1126.9915 1144.5414 1151.8345 1179.6032 1201.7124 1231.7804 1242.0676 1260.2918 1264.6025 1290.0353 1309.7981 1334.3218 1338.1148 1340.8557 1342.1650 1350.2977 1362.3346 1394.3415 1416.5832 1447.7514 1459.0035 1459.4834 1461.8291 1462.4560 1468.3882 1471.2588 1476.2292 1558.7191 1584.1208 2964.4643 2966.2558 2966.6765 2966.8888 2968.8009 2969.3485 3003.6533 3024.2308 3029.4682 3032.2444 3036.3937 3047.0547 3063.1795 3125.0452 3159.8840 3185.2725
redmass: 3.6100 4.2125 3.6744 4.0314 3.5783 1.1078 7.7147 5.2825 4.2998 4.2775 1.7879 5.9033 4.0445 5.7733 2.0223 9.2040 6.8407 3.4507 2.9354 5.0412 1.6895 4.8049 4.3816 4.3285 4.2800 5.6557 5.9330 2.8748 1.4641 5.2809 2.4923 1.4026 1.5389 1.7189 1.4398 3.6106 1.9377 9.1403 2.6033 1.7988 1.5126 1.2305 2.0250 2.1143 1.3420 2.1123 2.4363 1.5807 1.4632 1.9874 1.5960 1.7782 1.2719 1.4076 1.4595 1.2944 1.3561 1.3179 1.5866 1.4714 1.5996 3.3011 3.6545 1.7840 1.5688 1.0916 1.0566 1.0916 1.0893 1.0812 1.0567 1.0976 7.7456 8.0116 1.0596 1.0593 1.0382 1.0615 1.0614 1.0650 1.0838 1.0966 1.0952 1.1013 1.1013 1.1023 1.1031 1.1017 1.0919 1.0937
irintensity: 0.1984 0.4192 1.0918 2.3547 2.5260 0.0528 0.1688 0.4275 1.4766 4.9020 0.0617 2.0902 1.0093 2.5769 0.6608 2.7061 5.0565 0.3259 5.3414 0.4619 0.0136 2.2259 4.8488 5.4448 25.6088 36.1201 13.9211 8.6346 0.3719 31.5344 2.0047 24.2678 20.1538 12.2985 2.3086 35.5732 0.5051 42.4233 11.2474 0.8168 0.1969 0.7996 9.0782 0.3979 2.2725 30.0139 17.9209 10.7227 1.3002 36.1717 0.9385 22.9652 1.8120 5.0468 17.8474 0.2247 0.3184 0.3727 2.3177 0.4436 0.1746 11.8971 17.7425 61.9154 69.0065 3.9387 9.8578 7.7179 10.7157 17.5005 10.1964 5.2573 49.9601 37.0467 29.9854 10.0178 93.1299 33.2124 24.3500 14.8013 17.0994 80.6185 70.9791 8.0856 13.2875 111.4216 32.5122 21.3387 2.1061 1.1243
temp: 298.150 k
press: 1.00000 atm
elementType: 17 17 8 6 6 6 6 6 6 6 6 6 6 6 6 6 1 1 1 1 1 1 1 1 1 1 1 1 1 1 1 1
symmnumber: 1
zpe: 677803.3 jmol-1
zpe.correction: 0.258162 hartree
zpe.thermalcorrener: 0.274311 hartree
zpe.thermalcorrenthalpy: 0.275255 hartree
zpe.thermalcorrgfe: 0.212285 hartree
zpe.sumelectzpe: -1499.104801 hartree
zpe.sumelectthermal: -1499.088652 hartree
zpe.sumelectthermalent: -1499.087707 hartree
zpe.sumelectthermalfe: -1499.150678 hartree
dipole: -2.5664 -1.0380 -1.5782
dipole: 3.1866
quadrupole: -107.9057 -110.0636 -110.9693
quadrupole: -0.9078 -1.1055 5.5248
quadrupole: 1.7405 -0.4174 -1.3231 -0.9078 -1.1055 5.5248
hfenergy: -1499.3629626 hartree
pointgroup: C01 [X(C13H16Cl2O1)]
dipole: 1.0139913 0.4069127 -0.6148299 debye
polarizability: 197.3335274|0.3972557|184.875788|-1.2753687|2.2491813|102.2461867 unknown
InChI: InChI=1S/C13H16Cl2O/c1-16-13-11(7-10(14)8-12(13)15)9-5-3-2-4-6-9/h7-9H,2-6H2,1H3
charge 0 multiplicity 1
32 atoms
Cl -3.732872 1.872541 0.296776
Cl -2.486982 -3.503274 -0.294923
O  -0.690708 2.22716 0.357218
C  1.357733 0.18648 0.093114
C  2.069088 -0.183266 -1.241936
C  2.069408 -0.509397 1.290464
C  3.573485 0.174863 -1.196947
C  3.573952 -0.150963 1.333118
C  4.279082 -0.502379 0.001774
C  -0.131825 -0.138183 0.049458
C  -1.107597 0.896834 0.149906
C  -0.573461 -1.47989 -0.083146
C  -2.483972 0.558969 0.12316
C  -1.946658 -1.769551 -0.116554
C  -2.930301 -0.767928 -0.012151
C  -0.719729 3.088769 -0.845901
H  1.454814 1.279304 0.242269
H  1.574388 0.334694 -2.087114
H  1.95785 -1.271368 -1.429029
H  1.959163 -1.609739 1.198613
H  1.575651 -0.215562 2.236223
H  3.684473 1.27578 -1.109635
H  4.059052 -0.121527 -2.146923
H  4.060718 -0.677788 2.176606
H  3.683704 0.935764 1.528874
H  4.264433 -1.603112 -0.140239
H  5.343086 -0.19884 0.040663
H  0.155563 -2.291743 -0.160382
H  -3.996027 -1.006775 -0.026991
H  -1.742117 3.156923 -1.259951
H  -0.024704 2.7016 -1.616387
H  -0.38939 4.080105 -0.50162
