program: Gaussian 09
title: 000249973
version: EM64L-G09RevD.01
frameworkgroup: C1[X(C14H11N3O6)]
method: RPBEPBE
basis: SDD
operation: Freq
keyword: #p
keyword: freq=noraman
keyword: PBEPBE/SDD
title: #p freq=noraman PBEPBE/SDD
converged: YES YES NO NO
title: Mulliken charges:
elementType: O O O O O O N N N C C C C C C C C C C C C C C H H H H H H H H H H H
charge: -0.263193 -0.187058 -0.163535 -0.202156 -0.196187 -0.246490 -0.462244 0.010530 0.021004 0.231429 0.412908 0.279445 0.519352 -0.616711 -0.278865 -0.475589 0.428355 -0.394285 -0.376760 -0.367163 -0.181031 0.228625 -0.778168 0.257719 0.290997 0.330984 0.295672 0.272120 0.318712 0.238091 0.311462 0.215326 0.262915 0.263790
chargesum: 0.00000
title: Mulliken charges with hydrogens summed into heavy atoms:
elementType: O O O O O O N N N C C C C C C C C C C C C C C
charge: -0.263193 -0.187058 -0.163535 -0.202156 -0.196187 -0.246490 -0.150782 0.010530 0.021004 0.231429 0.412908 0.279445 0.519352 -0.358992 0.012132 -0.144605 0.428355 -0.122164 -0.081087 -0.048451 0.057059 0.228625 -0.036137
polarizability: 3.56347003e+02 4.70578019e+00 1.85640952e+02 5.53734073e+00 -1.34690275e+01 1.35946074e+02
1716.lowfreq: -4.3719 -1.2771 -0.0013 -0.0011 -0.0007 3.8504 12.7651 25.6983 39.3745
frequency: 12.6567 25.6772 39.3717 46.3089 53.9159 56.4852 67.4821 92.0714 101.1852 130.5747 148.8920 164.2804 172.7167 209.2471 259.7552 274.4308 284.1492 321.2519 338.4665 354.0580 359.4535 425.8975 429.8513 451.0297 487.6470 509.4023 515.6411 546.7788 567.9621 599.1931 617.9033 635.9776 644.2983 653.1194 670.9950 680.0453 691.4023 710.3845 733.5046 750.6525 757.9449 797.2200 805.7889 846.8981 871.9763 875.5745 896.7198 920.1694 951.2550 970.4166 984.1870 991.8485 998.0032 1004.1365 1040.6104 1054.6614 1088.9660 1112.0309 1131.8819 1145.5871 1180.6318 1204.6925 1215.5969 1221.1294 1240.3361 1255.8704 1267.7017 1308.4778 1359.4119 1375.6157 1377.0524 1391.3818 1398.6953 1420.6470 1429.6614 1448.7732 1467.6104 1469.4354 1480.5767 1512.0568 1585.8304 1589.2188 1606.9949 1625.2703 1633.7961 2997.3115 3098.8235 3100.9497 3147.4976 3148.5248 3169.9815 3171.7703 3187.8996 3189.9451 3201.2053 3536.7054
redmass: 7.0923 6.6828 7.7465 7.0340 1.2252 11.4984 7.1667 3.5419 4.5478 10.2564 5.8266 5.7681 8.3790 6.6075 3.7589 7.5049 9.2645 10.8465 4.1116 7.7947 7.5092 4.7003 5.0671 3.2978 5.1525 6.3597 4.3374 5.3218 4.3230 3.3405 7.3069 2.3853 5.5239 2.6606 4.9791 5.9660 2.2121 6.5298 7.0424 5.7338 9.5728 1.4735 4.3638 1.4418 6.0547 1.7204 5.8159 1.3706 1.4609 3.6779 4.9152 1.3406 1.3120 1.7852 1.6384 2.1957 1.6041 4.0403 1.9348 1.3098 1.1284 9.2227 5.7946 3.7830 2.6895 1.7000 2.1203 1.7348 6.6133 10.2203 4.4488 1.2712 7.3879 3.4170 6.5204 1.0448 2.7797 1.1337 2.6596 2.2382 9.0274 6.1933 6.9614 5.5231 5.8470 1.0364 1.0997 1.0989 1.0925 1.0885 1.0936 1.0919 1.0930 1.0963 1.0954 1.0766
irintensity: 0.2464 2.0365 2.9160 3.7498 1.3676 0.8143 5.1169 2.3350 0.6254 5.7523 1.0799 10.9011 1.5623 2.5350 0.7936 0.6284 0.5105 0.6705 1.1885 0.2756 0.5139 6.3377 2.7098 10.4423 3.5328 5.8165 16.2388 0.4849 4.1111 0.2429 7.2906 34.9224 19.3422 30.8980 1.2719 23.2613 23.4979 13.3296 11.7029 6.9754 21.1679 38.1068 6.5299 27.1170 8.7255 42.7501 53.9572 6.0891 24.8731 3.4762 11.0499 2.3516 5.8102 67.6943 14.9746 52.7959 15.4655 9.6237 74.0063 70.1903 2.8660 394.4559 482.0267 12.3965 379.5984 13.1441 118.3060 45.7647 106.1482 121.8608 221.8369 46.5027 30.1485 155.9223 20.9215 15.9073 152.4194 44.4499 181.4881 176.0347 42.4530 269.5976 217.3653 78.4014 101.1088 9.5794 13.7220 9.6283 3.9175 9.1800 1.3905 1.2201 14.1467 8.0205 11.8453 13.5410
temp: 298.150 k
press: 1.00000 atm
elementType: 8 8 8 8 8 8 7 7 7 6 6 6 6 6 6 6 6 6 6 6 6 6 6 1 1 1 1 1 1 1 1 1 1 1
symmnumber: 1
zpe: 622638.8 jmol-1
zpe.correction: 0.237151 hartree
zpe.thermalcorrener: 0.257741 hartree
zpe.thermalcorrenthalpy: 0.258685 hartree
zpe.thermalcorrgfe: 0.183860 hartree
zpe.sumelectzpe: -1153.885319 hartree
zpe.sumelectthermal: -1153.864729 hartree
zpe.sumelectthermalent: -1153.863785 hartree
zpe.sumelectthermalfe: -1153.938609 hartree
dipole: 6.0610 -1.3579 -2.0200
dipole: 6.5315
quadrupole: -164.8224 -150.6944 -122.1929
quadrupole: 8.1231 -22.9401 -6.6817
quadrupole: -18.9192 -4.7911 23.7103 8.1231 -22.9401 -6.6817
hfenergy: -1154.1224697 hartree
pointgroup: C01 [X(C14H11N3O6)]
dipole: -2.2049324 1.2994841 -0.2299918 debye
polarizability: 351.5029388|-26.4193249|142.2632669|19.7147549|15.988783|184.1678232 unknown
InChI: InChI=1S/C14H11N3O6/c1-9(18)15-10-3-2-4-12(7-10)23-14-6-5-11(16(19)20)8-13(14)17(21)22/h2-8,15H,1H3
charge 0 multiplicity 1
34 atoms
O  0.17294 -0.659095 -0.676457
O  3.455091 -1.888592 -2.618545
O  1.50594 -2.764263 -1.812221
O  5.33626 1.290112 2.543285
O  6.300895 -0.032103 0.949404
O  -6.136899 1.288612 0.389683
N  -4.243659 1.255594 -1.000896
N  2.486447 -1.933677 -1.764384
N  5.274171 0.497605 1.524653
C  1.38031 -0.416063 -0.046043
C  -1.074996 -0.409241 -0.019258
C  2.555564 -0.984611 -0.623742
C  -3.31833 0.517855 -0.21387
C  -2.01898 0.321664 -0.755272
C  1.521086 0.451421 1.070428
C  3.833183 -0.67467 -0.129019
C  3.934703 0.17924 0.983727
C  -1.369235 -0.974356 1.238683
C  2.789536 0.746265 1.589711
C  -3.639205 -0.022642 1.062263
C  -2.662805 -0.761041 1.764014
C  -5.56804 1.600777 -0.695303
C  -6.284063 2.391718 -1.786574
H  -1.738706 0.715907 -1.738124
H  0.62922 0.905641 1.509499
H  4.727716 -1.094046 -0.596713
H  2.913353 1.416046 2.44452
H  -0.629883 -1.579108 1.771788
H  -4.637888 0.134361 1.471559
H  -2.921081 -1.191142 2.737226
H  -3.898241 1.567419 -1.911121
H  -5.6602 2.607959 -2.671148
H  -6.641608 3.345044 -1.361331
H  -7.174793 1.826512 -2.110927
