program: Gaussian 09
title: 000249915
version: EM64L-G09RevD.01
frameworkgroup: C1[X(C12H14O2)]
method: RPBEPBE
basis: SDD
operation: Freq
keyword: #pfreq=noraman
keyword: PBEPBE/SDD
title: #p freq=noraman PBEPBE/SDD
converged: YES YES NO NO
title: Mulliken charges:
elementType: O O C C C C C C C C C C C C H H H H H H H H H H H H H H
charge: -0.301953 -0.210184 0.395229 0.248575 -0.643302 -0.542888 0.464896 -0.349255 -0.414290 -0.812844 -0.021507 0.234630 -0.590825 -0.747238 0.213659 0.249937 0.236148 0.244433 0.234964 0.229384 0.224002 0.235334 0.241656 0.215855 0.213725 0.248784 0.251544 0.251530
chargesum: 0.00000
title: Mulliken charges with hydrogens summed into heavy atoms:
elementType: O O C C C C C C C C C C C C
charge: -0.301953 -0.210184 0.395229 0.248575 -0.179706 -0.306740 0.464896 -0.104822 -0.179327 -0.124123 0.220148 0.234630 -0.161245 0.004621
polarizability: 1.64879312e+02 4.20078624e+00 1.43453338e+02 -5.73251164e+00 1.00953412e+01 9.55978804e+01
1716.lowfreq: -26.7978 -11.8600 -6.8594 -4.0255 0.0003 0.0004 0.0005 27.9970 34.7761
frequency: -26.6570 27.8227 34.7621 56.0298 72.4744 75.0537 88.2289 127.4416 171.3955 242.6277 264.6808 299.0487 304.7244 358.3636 391.1361 444.3457 464.1751 485.8851 536.4932 556.6068 571.8668 615.8211 654.5887 706.2005 728.7757 768.4991 823.9602 854.0212 883.9789 899.2892 930.5289 942.7072 944.6242 954.9792 989.4596 1001.0961 1011.6722 1039.5825 1049.2594 1079.2133 1112.8607 1150.5011 1169.9200 1192.2151 1197.6090 1250.1773 1273.2947 1287.8671 1301.4447 1375.3398 1382.6792 1397.8368 1409.3752 1425.8273 1452.1443 1453.2046 1469.5880 1471.0408 1476.7449 1486.5121 1596.7693 1617.9636 1656.8117 1673.0541 2977.0533 2982.0278 3008.2338 3050.0341 3056.1303 3084.1266 3085.4711 3096.3624 3107.0296 3117.1512 3133.3288 3144.8141 3163.0698 3193.4685
redmass: 1.0258 1.4529 3.4921 4.1754 3.4696 2.7382 2.5828 2.6101 4.7115 3.1875 2.9743 3.4161 3.6261 4.0290 2.3896 3.2193 3.1823 4.4444 2.6773 3.1561 2.3076 4.3781 2.7959 4.7231 3.9191 3.3899 1.6160 3.7435 1.4663 1.9363 1.6883 2.2139 1.5072 1.4023 1.9913 1.4471 1.1872 1.6494 1.5555 2.3061 2.2002 1.4687 2.6710 1.6357 1.7145 2.7599 1.3408 1.2667 1.4968 6.1068 1.2392 1.2610 2.9980 1.2497 1.0577 1.0480 1.1722 1.0568 1.1204 2.3921 6.6835 6.9693 4.6937 9.9850 1.0377 1.0624 1.0370 1.0974 1.0970 1.0601 1.0989 1.0970 1.0946 1.0914 1.0889 1.1012 1.0963 1.1142
irintensity: 0.4920 2.0675 1.1444 0.7402 1.0613 1.8261 1.4119 1.0217 1.3766 2.7202 2.8194 1.0618 0.4634 1.5252 1.8400 8.7079 5.4134 4.3281 3.6420 3.3019 9.0599 12.7002 8.2399 0.9590 1.2888 0.5636 29.0042 68.2402 4.4746 10.1467 26.0121 4.2293 45.9078 7.5936 72.9539 6.0678 11.1485 9.7945 13.8269 52.9924 103.5606 47.2568 333.7199 20.7675 2.4965 3.4111 1.4915 1.1966 0.0186 2.1803 61.4126 9.5257 4.3883 3.4784 26.3016 17.5327 22.8589 10.2155 15.2271 54.0527 1.3787 7.8977 17.8183 160.4141 35.7089 15.6382 1.7888 11.0775 20.2870 12.3699 19.5264 6.8404 8.1126 15.4138 14.0655 9.8453 9.4176 26.8105
temp: 298.150 k
press: 1.00000 atm
elementType: 8 8 6 6 6 6 6 6 6 6 6 6 6 6 1 1 1 1 1 1 1 1 1 1 1 1 1 1
symmnumber: 1
zpe: 591735.8 jmol-1
zpe.correction: 0.225380 hartree
zpe.thermalcorrener: 0.239631 hartree
zpe.thermalcorrenthalpy: 0.240576 hartree
zpe.thermalcorrgfe: 0.182164 hartree
zpe.sumelectzpe: -615.077066 hartree
zpe.sumelectthermal: -615.062815 hartree
zpe.sumelectthermalent: -615.061871 hartree
zpe.sumelectthermalfe: -615.120282 hartree
dipole: -0.3145 0.2860 -1.3429
dipole: 1.4086
quadrupole: -68.7492 -79.2802 -88.5207
quadrupole: -0.9631 -5.4413 7.1716
quadrupole: 10.1009 -0.4302 -9.6707 -0.9631 -5.4413 7.1716
hfenergy: -615.3024462 hartree
pointgroup: C01 [X(C12H14O2)]
dipole: 0.1075046 -0.188529 -0.5099102 debye
polarizability: 165.5892458|2.1947678|139.536866|3.940181|-16.0393022|98.8044192 unknown
InChI: InChI=1S/C12H14O2/c1-4-5-11-8-9(2)6-7-12(11)14-10(3)13/h4,6-8H,1,5H2,2-3H3
charge 0 multiplicity 1
28 atoms
O  -1.364131 0.906376 -0.78429
O  -1.84171 1.809197 1.329888
C  0.335022 -0.492027 0.363781
C  0.00903 0.627612 -0.440651
C  -0.738148 -1.410595 0.939126
C  1.709016 -0.748766 0.58217
C  2.734379 0.064422 0.034482
C  0.994593 1.453618 -1.006007
C  2.357245 1.169803 -0.767657
C  4.195993 -0.241111 0.313584
C  -1.398317 -2.27222 -0.129049
C  -2.211543 1.513808 0.178433
C  -1.509835 -3.62192 -0.069566
C  -3.583986 1.717417 -0.422369
H  -0.29251 -2.061494 1.712598
H  -1.508904 -0.797426 1.447214
H  1.98547 -1.614838 1.197185
H  0.691417 2.303001 -1.626256
H  3.128834 1.811828 -1.207643
H  4.429363 -1.305736 0.128662
H  4.863988 0.367201 -0.319947
H  4.453694 -0.030179 1.369171
H  -1.799063 -1.729745 -0.997557
H  -2.000702 -4.192203 -0.866334
H  -1.113222 -4.197314 0.776709
H  -4.229588 2.243403 0.295136
H  -4.03129 0.740107 -0.676364
H  -3.508895 2.29578 -1.35875
