program: Gaussian 09
title: 000249923
version: EM64L-G09RevD.01
frameworkgroup: C1[X(C13H16O6)]
method: RPBEPBE
basis: SDD
operation: Freq
keyword: #pfreq=noraman
keyword: PBEPBE/SDD
title: #p freq=noraman PBEPBE/SDD
converged: YES YES NO NO
title: Mulliken charges:
elementType: O O O O O O C C C C C C C C C C C C C H H H H H H H H H H H H H H H H
charge: -0.256489 -0.280233 -0.280713 -0.235016 -0.266614 -0.241098 0.211086 0.152369 -0.312565 -0.245568 -0.369283 0.153736 -0.327470 -0.218251 -0.220186 0.170157 -0.204983 -0.500088 -0.501546 0.242488 0.234421 0.215344 0.255906 0.268177 0.271239 0.239824 0.238238 0.202616 0.210890 0.244715 0.242025 0.235040 0.201263 0.234838 0.235732
chargesum: 0.00000
title: Mulliken charges with hydrogens summed into heavy atoms:
elementType: O O O O O O C C C C C C C C C C C C C
charge: -0.256489 -0.280233 -0.280713 -0.235016 -0.266614 -0.241098 0.211086 0.152369 0.164344 0.225681 -0.101106 0.153736 -0.056231 0.021574 0.018052 0.170157 0.208523 0.221692 0.170286
polarizability: 2.13208774e+02 9.37199400e+00 1.75710727e+02 4.95166382e+00 6.89726041e+00 1.01141984e+02
1716.lowfreq: -7.1448 -3.9319 -0.0010 -0.0008 -0.0005 3.4453 8.5280 22.3343 27.2764
frequency: 7.4218 22.2482 27.2597 38.7283 52.7586 83.9441 85.2376 93.3252 104.5753 109.1655 133.6150 138.1270 155.7553 184.8386 213.0999 240.4021 257.7094 273.7097 298.5004 321.1162 351.7244 361.1630 415.6159 424.7665 458.5150 517.6536 541.9726 580.2330 640.7148 670.9517 675.0628 702.9832 751.5214 775.5804 787.3174 790.5151 824.6692 846.0471 874.7717 901.6862 918.1058 929.7102 976.8599 982.4335 1004.3716 1030.6958 1042.7558 1049.5098 1067.6219 1085.2557 1104.6882 1112.1872 1112.8127 1118.0727 1122.4513 1147.9404 1166.4796 1177.8796 1198.7747 1233.4638 1249.9470 1258.2182 1273.1407 1278.7588 1325.3276 1366.7983 1380.9847 1388.7427 1421.2473 1427.4368 1429.9443 1442.0391 1451.0230 1454.4832 1460.1953 1463.1165 1475.7065 1477.3972 1486.8989 1578.6285 1602.5344 1622.8641 1626.9298 2951.0123 2969.4093 2989.8990 3004.2954 3043.1701 3047.8758 3048.8270 3064.2111 3106.0407 3118.9512 3129.4889 3139.1150 3149.9704 3153.9141 3168.4411 3181.2415
redmass: 4.4524 3.8944 5.8722 4.9530 3.9356 1.8174 2.1355 2.6313 2.0944 2.8006 4.0904 1.9656 3.4594 3.4373 4.8636 4.7151 4.8990 4.4032 4.6370 4.0257 8.7113 6.2110 3.0933 2.4744 5.0053 5.2281 5.0268 5.6782 6.2540 5.9261 5.9388 4.0312 3.9802 5.1888 1.5793 3.2510 1.4153 5.2727 5.7808 1.4930 7.1557 5.9495 1.4125 5.5711 1.3566 4.1307 4.8042 4.6389 2.9729 3.1639 1.9820 1.2785 1.2774 1.6424 1.8135 1.4833 1.5605 1.0620 1.2111 3.7256 3.0599 1.1195 1.1195 1.5367 1.2721 1.1482 10.6762 1.3594 1.2379 1.1345 2.0161 1.0920 1.0504 1.0544 1.1098 1.0516 1.1198 2.2559 1.0812 7.2062 6.4173 10.4350 10.0868 1.0364 1.0529 1.0595 1.0296 1.0588 1.1004 1.1101 1.1041 1.1045 1.1007 1.1078 1.0863 1.1047 1.0912 1.0966 1.0978
irintensity: 0.0938 0.9381 0.7979 0.0935 1.1955 0.1945 2.2688 1.0035 3.2822 1.4058 3.7158 0.2473 3.3665 14.2645 0.5561 12.6158 2.9495 9.0038 14.1115 19.9963 6.8259 3.0457 0.4628 5.5032 8.1072 1.5770 10.4399 4.7129 4.2301 5.4572 2.0352 66.0696 16.0917 10.2348 40.5783 4.3331 1.5768 37.8374 28.6810 3.9466 11.9765 0.9533 6.2651 346.9183 1.4401 129.6921 84.0700 103.8390 79.8575 157.0859 13.3198 1.3885 0.4005 7.0216 23.1395 46.5258 4.6365 0.2196 14.3381 134.0195 280.1845 0.0610 3.8725 28.1115 15.8871 14.2022 8.7519 0.7996 30.5112 7.1916 1.7509 1.3550 14.5366 11.2771 13.4995 16.0109 9.4936 18.6158 4.1616 23.3815 37.8776 201.4112 131.0558 67.8281 99.2617 29.2838 33.5515 31.2113 55.6312 33.8068 14.2164 24.3640 26.0444 13.7391 1.9705 16.4070 9.1461 11.9968 11.2042
temp: 298.150 k
press: 1.00000 atm
elementType: 8 8 8 8 8 8 6 6 6 6 6 6 6 6 6 6 6 6 6 1 1 1 1 1 1 1 1 1 1 1 1 1 1 1 1
symmnumber: 1
zpe: 714920.0 jmol-1
zpe.correction: 0.272299 hartree
zpe.thermalcorrener: 0.292536 hartree
zpe.thermalcorrenthalpy: 0.293480 hartree
zpe.thermalcorrgfe: 0.218704 hartree
zpe.sumelectzpe: -954.853124 hartree
zpe.sumelectthermal: -954.832886 hartree
zpe.sumelectthermalent: -954.831942 hartree
zpe.sumelectthermalfe: -954.906719 hartree
dipole: -2.3294 1.7561 1.1357
dipole: 3.1305
quadrupole: -87.9971 -97.3981 -116.2425
quadrupole: -0.1998 4.7977 0.9752
quadrupole: 12.5488 3.1478 -15.6966 -0.1998 4.7977 0.9752
hfenergy: -955.1254223 hartree
pointgroup: C01 [X(C13H16O6)]
dipole: -0.8743215 0.733533 0.4629991 debye
polarizability: 214.0512967|6.0279744|173.7372717|8.3401265|10.1896421|102.2729159 unknown
InChI: InChI=1S/C13H16O6/c1-16-9-18-7-8-19-13(15)11-6-4-3-5-10(11)12(14)17-2/h3-6H,7-9H2,1-2H3
charge 0 multiplicity 1
35 atoms
O  0.194301 -0.639387 1.33299
O  3.895261 -0.360296 1.218194
O  -1.798998 2.77572 0.37774
O  0.217348 -2.263477 -0.346472
O  5.086193 0.130077 -0.845625
O  -0.042699 1.520888 -0.491967
C  -1.777892 -0.901855 0.004756
C  -2.208193 0.456636 -0.043241
C  1.623196 -0.925869 1.636501
C  2.53009 -0.095298 0.721546
C  -2.727001 -1.939715 -0.156574
C  -0.360705 -1.329775 0.258099
C  -3.589139 0.741857 -0.195501
C  -4.09738 -1.644964 -0.319646
C  -4.531139 -0.299928 -0.323945
C  -1.22325 1.583342 -0.074702
C  4.916153 0.43756 0.557724
C  -0.917533 3.965446 0.322251
C  5.584965 -1.232898 -1.087879
H  1.822034 -2.003537 1.507378
H  1.747357 -0.63169 2.68932
H  2.289433 0.983694 0.797785
H  2.429364 -0.40612 -0.333372
H  -2.375992 -2.976375 -0.143354
H  -3.906768 1.787347 -0.228311
H  -4.819935 -2.459274 -0.437717
H  -5.593544 -0.062928 -0.442925
H  5.836758 0.226475 1.137785
H  4.656509 1.513675 0.570959
H  -0.575131 4.141658 -0.711446
H  -0.039855 3.817682 0.973597
H  -1.542505 4.794032 0.68309
H  6.564602 -1.390708 -0.590185
H  5.703966 -1.317393 -2.1786
H  4.867433 -1.992297 -0.726157
