program: Gaussian 09
title: 000249875
version: EM64L-G09RevD.01
frameworkgroup: C1[X(C7H13NO)]
method: RPBEPBE
basis: SDD
operation: Freq
keyword: #p
keyword: freq=noraman
keyword: PBEPBE/SDD
title: #p freq=noraman PBEPBE/SDD
converged: YES YES NO NO
title: Mulliken charges:
elementType: O N C C C C C C C H H H H H H H H H H H H H
charge: -0.276351 -0.088513 -0.346700 -0.459421 -0.292126 -0.325785 0.440255 -0.703364 -0.717942 0.193351 0.217008 0.233387 0.191059 0.175735 0.207503 0.214443 0.210444 0.232525 0.218132 0.215529 0.232657 0.228174
chargesum: 0.00000
title: Mulliken charges with hydrogens summed into heavy atoms:
elementType: O N C C C C C C C
charge: -0.276351 -0.088513 0.063659 -0.034975 0.091112 0.099101 0.440255 -0.037178 -0.257111
polarizability: 9.56202347e+01 -7.82302440e+00 9.81424378e+01 3.31217584e+00 -1.48305957e+00 6.24944649e+01
1716.lowfreq: -14.6152 -0.0012 -0.0011 -0.0009 4.6589 15.9961 72.7923 107.2120 123.7805
frequency: 72.7591 107.1987 123.7553 203.4583 219.1565 266.1415 337.9665 382.5530 401.2696 437.2014 458.3035 512.6700 615.3903 714.2918 772.2532 779.8582 799.3935 876.8194 883.8308 923.6319 950.9226 982.8199 1000.8028 1051.1149 1073.8486 1091.9428 1113.8288 1135.1254 1176.8320 1199.9261 1236.1446 1259.8162 1265.3353 1292.6342 1326.3708 1350.7383 1366.7609 1382.9301 1392.8535 1407.9157 1449.2095 1455.0072 1458.8682 1469.8547 1473.9487 1490.0223 1670.7463 2809.8890 2834.5659 2856.0642 2987.2777 2997.0155 3013.8793 3032.0608 3075.9136 3082.4882 3093.1570 3095.2038 3120.0077 3232.6996
redmass: 2.3946 2.5091 2.8714 1.4474 2.5819 1.5305 2.3730 3.4359 2.1885 2.8841 3.2567 2.9139 2.8863 1.1447 2.5468 3.5632 1.1426 1.8900 1.5458 2.1705 2.1052 1.9104 2.0841 2.8552 2.1971 2.2280 1.9866 2.3636 1.7998 1.4631 1.5247 1.6025 1.2554 1.3732 1.2999 1.4063 1.3424 1.3377 1.2973 1.2030 1.0774 1.0921 1.0914 1.0574 1.0589 1.0665 6.1780 1.0706 1.0710 1.0696 1.0359 1.0641 1.0878 1.0880 1.0925 1.0932 1.1003 1.1020 1.0624 1.1154
irintensity: 0.5127 0.2969 5.5088 3.4127 5.2512 3.2884 0.8669 2.3217 4.0249 0.8641 0.9954 5.5769 1.1302 3.7021 8.5589 10.9882 5.2928 42.6854 70.3268 8.6008 2.4148 23.9559 6.0520 72.6224 2.0011 19.0409 22.2948 71.7967 11.2894 8.0236 6.9335 82.1506 22.1978 23.7995 20.2515 8.3796 0.9945 2.9353 22.7970 2.6205 1.2282 21.0590 0.8921 8.8654 7.9470 11.9824 108.0786 57.5347 63.2218 174.0736 25.0447 47.9030 18.8524 55.9453 26.9511 43.9178 32.8101 32.6867 0.5648 9.8145
temp: 298.150 k
press: 1.00000 atm
elementType: 8 7 6 6 6 6 6 6 6 1 1 1 1 1 1 1 1 1 1 1 1 1
symmnumber: 1
zpe: 500304.9 jmol-1
zpe.correction: 0.190556 hartree
zpe.thermalcorrener: 0.199993 hartree
zpe.thermalcorrenthalpy: 0.200937 hartree
zpe.thermalcorrgfe: 0.156249 hartree
zpe.sumelectzpe: -403.737722 hartree
zpe.sumelectthermal: -403.728285 hartree
zpe.sumelectthermalent: -403.727341 hartree
zpe.sumelectthermalfe: -403.772028 hartree
dipole: 2.3583 -0.8897 0.4048
dipole: 2.5529
quadrupole: -58.6729 -49.9966 -58.2134
quadrupole: 0.2417 2.2616 0.9456
quadrupole: -3.0453 5.6310 -2.5858 0.2417 2.2616 0.9456
hfenergy: -403.9282779 hartree
pointgroup: C01 [X(C7H13N1O1)]
dipole: 0.9329204 0.3329288 -0.1661407 debye
dipolederiv: -0.4507759 0.1519012 0.0659375 -0.2574458 -1.2995178 -0.0517338 0.1235715 0.0628773 -0.3473785 -0.7119969 0.0456259 0.0326881 0.083813 -0.4976057 0.0046541 0.0091247 0.0059336 -0.5571161 0.0207663 -0.173965 0.0595769 -0.1733972 0.3589536 -0.0891076 0.0598842 -0.1292918 0.3578174 0.110444 0.2498513 0.0863781 0.1768854 0.2057851 0.0473318 0.1845954 0.1126398 0.4648887 0.6183348 -0.0370285 -0.0851484 -0.0500506 0.1148317 -0.0066353 -0.0906903 -0.0066623 0.425874 0.3992706 0.3142223 0.0315872 0.1975616 0.6848702 0.090144 0.0078863 0.1278864 0.3971253 0.3592761 -0.24192 -0.1879721 0.156876 1.1743439 -0.0690216 -0.2551518 -0.2113209 0.0661164 -0.0578132 0.0940496 -0.0229475 0.1015692 -0.023032 0.0329988 0.0117838 0.0467681 0.037368 -0.2169807 -0.2594099 -0.0343675 -0.1976867 -0.4003991 0.0135886 -0.0890081 0.0439767 -0.4787878 0.0116128 0.0558057 0.0153402 0.0697349 -0.0187547 -0.0017935 -0.0280501 0.1756045 -0.2509809 -0.0085173 -0.1506895 -0.0579188 -0.0653577 -0.0732045 -0.0528363 -0.0556211 -0.0691121 0.0433366 0.0772671 0.0616298 -0.0043694 0.0619094 -0.1084632 0.0212234 -0.0340093 0.0299809 0.0570124 -0.0575463 -0.078283 0.0619374 -0.0674612 0.0102372 0.0775051 -0.0178027 -0.0639498 -0.2539474 -0.0740071 0.027195 -0.0315504 0.0269999 0.0315552 0.034592 0.157786 0.0495418 -0.2842614 -0.0203796 -0.0495152 -0.0169016 -0.1068331 -0.1263475 -0.0619009 -0.0349023 -0.0807001 0.0403209 0.0251024 -0.1010381 -0.0258439 -0.0508076 0.0118436 0.0444564 -0.0032235 -0.097632 -0.1772484 -0.0154233 0.0878347 -0.0140618 0.0693458 -0.1336789 0.0093313 -0.0445017 0.0525902 0.0788814 0.1191746 -0.0100182 0.0521604 0.0101031 0.0697603 0.0165107 -0.0094932 0.0443552 -0.1400784 0.0843727 -0.1022011 -0.0508673 -0.0525141 -0.1026665 -0.0673114 -0.0557577 -0.0879815 0.0318076 -0.198475 0.0119985 0.0377895 -0.0225549 0.0835657 0.0145672 0.0580353 0.0103355 0.0943394 -0.0688737 0.013307 0.0605071 0.0254189 0.0879404 -0.0001313 0.0688052 0.009956 0.2040744 0.0551675 0.0906476 0.0280466 0.0638918 -0.050017 -0.0064316 0.0367393 -0.0257952 0.1908363 unknown
polarizability: 95.8623558|7.9327035|97.8411703|-3.677732|-0.7475789|62.5536113 unknown
InChI: InChI=1S/C7H13NO/c1-3-8-4-5-9-7(2)6-8/h2-6H2,1H3
charge 0 multiplicity 1
22 atoms
O  -1.99821 0.531483 -0.090966
N  0.88462 0.289596 0.18715
C  0.254923 1.599293 -0.113292
C  0.087113 -0.794588 -0.451121
C  2.313514 0.257263 -0.219831
C  -1.161802 1.623279 0.465794
C  -1.382659 -0.743336 -0.058131
C  3.062528 -0.985406 0.293884
C  -2.150171 -1.832427 0.1899
H  0.212959 1.801023 -1.21517
H  0.850972 2.403666 0.357592
H  0.492781 -1.774872 -0.156621
H  0.156719 -0.717719 -1.570755
H  2.419269 0.32536 -1.335051
H  2.790739 1.162207 0.20312
H  -1.120114 1.510127 1.566459
H  -1.69548 2.550277 0.200468
H  2.928578 -1.086174 1.385142
H  2.711357 -1.916338 -0.185974
H  4.142744 -0.892105 0.079498
H  -3.216273 -1.727973 0.4098
H  -1.724405 -2.838436 0.148306
