program: Gaussian 09
title: 000249883
version: EM64L-G09RevD.01
frameworkgroup: C1[X(C10H15N3)]
method: RPBEPBE
basis: SDD
operation: Freq
keyword: #pfreq=noraman
keyword: PBEPBE/SDD
title: #p freq=noraman PBEPBE/SDD
converged: YES YES NO NO
title: Mulliken charges:
elementType: N N N C C C C C C C C C C H H H H H H H H H H H H H H H
charge: -0.142543 -0.064931 -0.650058 -0.164514 -0.462368 -0.446261 -0.370780 0.309208 -0.654789 0.000990 -0.332418 -0.211111 -0.339858 0.195874 0.202861 0.245052 0.228877 0.215879 0.230010 0.174088 0.245059 0.191083 0.224769 0.277928 0.223156 0.322529 0.322443 0.229827
chargesum: 0.00000
title: Mulliken charges with hydrogens summed into heavy atoms:
elementType: N N N C C C C C C C C C C
charge: -0.142543 -0.064931 -0.005087 0.031359 -0.014456 -0.001505 0.033318 0.309208 0.006122 0.000990 -0.054490 0.012045 -0.110031
polarizability: 1.52552470e+02 5.01100789e+00 1.29316287e+02 3.01831703e+00 1.39311849e+01 9.11940299e+01
1716.lowfreq: -10.6426 -0.8729 -0.0005 -0.0003 0.0002 14.7223 43.1913 55.7890 103.6495
frequency: 42.2334 55.3869 103.6405 139.6082 182.2041 205.4194 227.4695 236.9136 282.8885 312.0247 321.8321 379.3520 439.9378 474.3190 524.1235 550.9017 557.8260 564.5800 594.8094 631.0336 728.5156 777.9164 798.5351 821.9222 864.1088 869.5675 906.3491 931.9485 940.5548 950.7971 974.0702 989.4824 1044.0636 1047.8047 1057.8515 1079.1091 1104.0210 1113.9790 1139.9527 1172.0536 1184.7641 1202.3188 1219.8331 1234.6996 1267.4642 1287.5069 1295.0002 1307.7765 1314.4483 1332.2947 1341.3282 1367.7871 1433.7994 1436.0855 1452.7066 1461.7167 1469.4911 1475.1567 1479.2602 1491.6582 1560.7260 1587.2819 1613.4530 2799.5970 2842.4929 2861.6374 2997.1109 3015.7272 3021.8818 3032.4607 3071.6533 3078.8244 3090.2977 3124.6923 3141.6862 3167.4591 3555.2534 3713.6755
redmass: 2.7450 3.6562 3.1267 3.3888 2.8759 1.8869 1.3851 2.4313 1.3459 2.6072 2.8344 2.8118 3.0645 2.4314 1.6926 3.0926 3.4641 2.6140 4.4907 3.3951 3.3721 3.6943 1.3789 3.1081 2.1163 2.7969 2.9644 2.3564 1.4281 1.9840 1.8729 1.3109 2.2887 1.9302 1.9784 1.7479 1.3200 1.3386 1.3515 1.4828 2.3469 1.9443 2.0282 1.4665 1.7412 1.3826 1.4204 1.5673 1.5032 3.0591 1.7843 1.8875 1.6359 1.4702 3.2442 1.1031 1.0557 1.0992 1.0526 1.0965 5.5385 3.1532 1.6236 1.0803 1.0703 1.0577 1.0644 1.0669 1.0728 1.0832 1.0996 1.1011 1.1054 1.0884 1.0901 1.0990 1.0450 1.1038
irintensity: 0.1738 0.0622 1.7123 2.9326 3.4111 1.1190 1.7081 2.1656 146.9399 5.4268 45.4945 7.3906 11.4326 20.7737 50.7801 6.2205 3.4451 1.9251 0.5188 0.2484 0.6988 29.5062 34.9546 2.3181 9.8504 5.3730 6.4908 4.3656 0.5521 1.5821 0.4849 1.1227 14.0713 26.1642 19.2328 3.3606 5.9940 1.6810 9.4858 11.1164 15.9442 27.2054 5.7947 6.9003 24.1130 0.3153 10.3116 6.0935 0.8182 11.1465 1.9442 10.1632 2.3599 4.3405 148.9070 14.3384 21.9425 5.5124 6.5481 5.9522 33.5602 1.8014 310.9798 52.9022 88.7216 196.4441 36.8353 20.8396 36.2748 63.2241 12.0658 29.2334 53.4894 18.6051 5.1768 31.1140 53.3856 33.4225
temp: 298.150 k
press: 1.00000 atm
elementType: 7 7 7 6 6 6 6 6 6 6 6 6 6 1 1 1 1 1 1 1 1 1 1 1 1 1 1 1
symmnumber: 1
zpe: 624870.0 jmol-1
zpe.correction: 0.238000 hartree
zpe.thermalcorrener: 0.250360 hartree
zpe.thermalcorrenthalpy: 0.251305 hartree
zpe.thermalcorrgfe: 0.199335 hartree
zpe.sumelectzpe: -553.324791 hartree
zpe.sumelectthermal: -553.312431 hartree
zpe.sumelectthermalent: -553.311487 hartree
zpe.sumelectthermalfe: -553.363457 hartree
dipole: 3.2559 1.0568 0.5882
dipole: 3.4733
quadrupole: -81.4082 -69.9387 -78.9129
quadrupole: 2.3446 1.3130 3.2187
quadrupole: -4.6550 6.8146 -2.1596 2.3446 1.3130 3.2187
hfenergy: -553.5627913 hartree
pointgroup: C01 [X(C10H15N3)]
dipole: -1.285872 0.3794673 0.2642315 debye
polarizability: 152.6190727|-5.8610033|105.58511|-2.1497238|22.9854832|114.8586044 unknown
InChI: InChI=1S/C10H15N3/c1-13-7-3-5-9(13)8-4-2-6-12-10(8)11/h2,4,6,9H,3,5,7,11H2,1H3
charge 0 multiplicity 1
28 atoms
N  -1.887406 0.074353 -0.811361
N  2.882223 0.275897 0.540683
N  1.366052 1.582336 1.73477
C  -0.954719 0.502331 0.267794
C  -1.579839 -0.086712 1.590613
C  -2.800322 -0.924898 1.115637
C  -3.200358 -0.229672 -0.199175
C  0.482776 0.055986 0.005854
C  -1.915152 0.946809 -1.993353
C  1.57307 0.625541 0.747106
C  0.801836 -0.927873 -0.948782
C  2.148916 -1.311599 -1.164512
C  3.148667 -0.672969 -0.401393
H  -0.953959 1.622699 0.346996
H  -1.920089 0.734719 2.249506
H  -0.848336 -0.689701 2.153545
H  -2.495021 -1.964879 0.905685
H  -3.61774 -0.942654 1.856839
H  -3.800736 -0.872706 -0.868454
H  -3.797582 0.694916 0.013589
H  -0.897966 1.042025 -2.412211
H  -2.294073 1.976238 -1.769449
H  -2.563596 0.504938 -2.771169
H  -0.025575 -1.37231 -1.512569
H  2.414332 -2.073213 -1.903375
H  0.437269 1.867826 2.025888
H  2.18757 1.943441 2.214577
H  4.208758 -0.91837 -0.536574
