program: Gaussian 09
title: 000249854
version: EM64L-G09RevD.01
frameworkgroup: C1[X(C9H14N2O2)]
method: RPBEPBE
basis: SDD
operation: Freq
keyword: #p
keyword: freq=noraman
keyword: PBEPBE/SDD
title: #p freq=noraman PBEPBE/SDD
converged: YES YES NO NO
title: Mulliken charges:
elementType: O O N N C C C C C C C C C H H H H H H H H H H H H H H
charge: -0.215499 -0.232782 -0.422837 -0.402743 -0.036482 0.177231 -0.484874 -0.468280 -0.428047 -0.440216 -0.721037 0.147664 0.156317 0.250965 0.195567 0.227188 0.244108 0.210848 0.213287 0.217345 0.206331 0.223286 0.246263 0.233622 0.232792 0.321876 0.348107
chargesum: 0.00000
title: Mulliken charges with hydrogens summed into heavy atoms:
elementType: O O N N C C C C C C C C C
charge: -0.215499 -0.232782 -0.100961 -0.054636 0.214483 0.177231 -0.062119 -0.013323 0.002585 -0.010600 -0.008361 0.147664 0.156317
polarizability: 1.19811978e+02 9.08639354e+00 1.11152586e+02 5.55246225e+00 -3.10443405e+00 9.86249187e+01
1716.lowfreq: -19.8240 -0.0008 -0.0006 -0.0005 5.5715 17.4409 20.1687 64.5915 83.5061
frequency: 11.4815 64.5082 83.4162 127.9624 159.6670 173.1949 222.2617 240.6308 262.4854 282.6189 327.9616 390.3714 450.2320 484.1528 505.9619 583.8976 599.1907 615.2801 638.0094 655.7701 703.3284 737.6754 752.2007 788.8764 831.9802 860.4418 897.5566 932.0800 936.1781 965.5408 967.6619 980.1389 1005.6871 1059.7262 1074.7430 1098.5833 1123.1034 1156.5485 1177.4237 1195.0133 1201.1760 1230.6875 1250.2951 1272.2296 1288.5543 1293.4722 1305.4777 1308.9253 1311.5797 1319.3778 1339.1387 1357.4994 1388.0158 1467.3924 1468.1965 1471.4337 1473.7967 1476.4464 1489.9875 1678.1033 1719.9441 2979.4671 2983.9508 2992.7420 2993.2582 2994.7408 3007.1890 3043.8811 3060.4437 3063.4479 3079.5595 3093.9378 3100.8931 3587.3038 3608.6460
redmass: 2.2277 5.1507 2.9868 3.8892 6.8444 2.3355 1.4978 1.7719 2.2812 5.0158 3.3649 6.8369 1.3917 2.0446 3.1502 2.4067 5.5486 5.0092 2.0386 1.6810 9.0391 6.7350 1.9147 1.7258 2.0737 2.4223 2.5754 1.7728 1.9816 1.7362 2.7779 1.5927 1.5267 2.1900 3.1523 2.2835 3.4075 1.8412 1.6031 2.1067 1.5872 2.6026 1.2318 1.3478 1.4355 1.2417 1.8672 1.3025 1.5461 3.2356 1.6162 1.6675 1.2371 1.0792 1.0907 1.0582 1.0767 1.0630 1.1002 8.3850 9.4736 1.0645 1.0691 1.0458 1.0622 1.0645 1.0652 1.0983 1.0984 1.1026 1.1046 1.1007 1.1003 1.0802 1.0797
irintensity: 0.1047 0.1024 0.2575 2.5406 1.5190 0.5497 0.6860 0.0822 0.4570 5.4139 0.2685 13.6982 88.0106 26.7090 10.9810 0.4594 14.3298 5.2278 58.8352 97.0773 13.4625 42.6860 12.5119 0.5710 2.7353 6.9789 3.7438 1.1513 3.4525 5.9391 17.7656 7.3342 1.8768 4.4385 10.7477 2.4632 17.7548 11.9185 0.6623 0.5725 9.2005 63.6501 15.8485 5.1009 22.9817 11.5612 72.9445 3.3578 6.3205 122.1385 6.9274 10.6472 16.3517 2.9804 7.5519 8.6296 16.1479 1.8299 2.2182 510.3549 400.0519 39.5349 12.0722 5.5643 24.9331 43.0245 45.7691 14.6760 17.0770 22.6542 83.3524 24.3457 14.5187 67.8859 32.9228
temp: 298.150 k
press: 1.00000 atm
elementType: 8 8 7 7 6 6 6 6 6 6 6 6 6 1 1 1 1 1 1 1 1 1 1 1 1 1 1
symmnumber: 1
zpe: 591103.2 jmol-1
zpe.correction: 0.225139 hartree
zpe.thermalcorrener: 0.237664 hartree
zpe.thermalcorrenthalpy: 0.238608 hartree
zpe.thermalcorrgfe: 0.184977 hartree
zpe.sumelectzpe: -610.352322 hartree
zpe.sumelectthermal: -610.339797 hartree
zpe.sumelectthermalent: -610.338853 hartree
zpe.sumelectthermalfe: -610.392484 hartree
dipole: 2.9299 0.5979 1.7853
dipole: 3.4827
quadrupole: -80.1514 -90.2904 -75.1039
quadrupole: -5.5476 2.2232 5.5785
quadrupole: 1.6972 -8.4419 6.7447 -5.5476 2.2232 5.5785
hfenergy: -610.577461 hartree
pointgroup: C01 [X(C9H14N2O2)]
dipole: 1.1703991 0.2692289 0.6596158 debye
polarizability: 120.0552846|9.2461855|110.8411538|4.5565627|-3.9296101|98.693044 unknown
InChI: InChI=1S/C9H14N2O2/c1-9(6-4-2-3-5-6)7(12)10-8(13)11-9/h6,10-11H,2-5H2,1H3
charge 0 multiplicity 1
27 atoms
O  -1.291338 1.890322 -1.416475
O  -2.597353 -2.216898 0.504222
N  -0.846834 -0.681104 1.020055
N  -2.189891 -0.188157 -0.702065
C  1.132472 0.513727 -0.030387
C  -0.325512 0.611623 0.519643
C  2.212864 0.17679 1.049605
C  1.350189 -0.548108 -1.140607
C  3.307619 -0.670546 0.315772
C  2.888668 -0.692506 -1.183158
C  -0.458663 1.73655 1.57552
C  -1.303935 0.89028 -0.660062
C  -1.941082 -1.164774 0.319316
H  1.352961 1.50965 -0.464734
H  1.777382 -0.407062 1.884596
H  2.633478 1.096004 1.493813
H  0.917533 -0.242367 -2.109581
H  0.885604 -1.509468 -0.84411
H  3.323372 -1.700496 0.717721
H  4.320118 -0.253116 0.45732
H  3.329022 0.171692 -1.717078
H  3.221549 -1.607932 -1.703255
H  -0.207929 2.708075 1.115991
H  -1.490041 1.78922 1.965417
H  0.227198 1.558044 2.421953
H  -0.473485 -1.180262 1.824639
H  -2.952166 -0.29128 -1.372271
