program: Gaussian 09
title: 000019812
version: EM64L-G09RevD.01
frameworkgroup: C1[X(C12H20NO)]
method: RPBEPBE
basis: SDD
operation: Freq
keyword: #p
keyword: freq=noraman
keyword: PBEPBE/SDD
title: #p freq=noraman PBEPBE/SDD
converged: YES YES NO NO
title: Mulliken charges:
elementType: O N C C C C C C C C C C C C H H H H H H H H H H H H H H H H H H H H
charge: -0.177724 -0.109602 -0.142964 -0.460488 -0.426493 -0.499821 0.131781 -0.546986 -0.394349 -0.550220 -0.550196 -0.549015 0.078850 -0.096698 0.270356 0.208870 0.227469 0.242918 0.224484 0.255505 0.272403 0.300524 0.262959 0.292803 0.291151 0.289429 0.264641 0.262767 0.272142 0.267784 0.269099 0.289972 0.261777 0.266870
chargesum: 1.00000
title: Mulliken charges with hydrogens summed into heavy atoms:
elementType: O N C C C C C C C C C C C C
charge: -0.177724 -0.109602 0.127393 -0.024149 0.040909 0.028087 0.131781 0.016496 0.189605 0.266617 0.258830 0.269605 0.078850 -0.096698
polarizability: 1.87927626e+02 -2.81420638e+00 1.19118633e+02 7.60031902e+00 -6.25104405e-01 1.01238198e+02
1716.lowfreq: -21.1495 -18.5822 -5.0262 -0.0005 -0.0003 0.0003 4.1776 26.0245 35.8929
frequency: -18.4322 24.2353 35.7177 76.4155 78.7500 99.2868 154.1993 179.2951 209.0046 238.6585 247.1821 248.4192 272.7222 325.1309 337.0210 344.3436 381.9773 398.1736 417.4196 423.1145 493.1373 522.7479 539.9634 567.4546 599.2358 716.2057 737.9028 797.7768 819.4365 825.5399 836.8187 901.4265 910.5076 921.1756 940.3093 950.0436 977.6280 1004.0712 1028.5265 1042.5607 1094.6164 1097.5552 1107.9682 1112.4967 1150.7905 1160.5127 1178.9281 1190.2951 1195.9186 1220.8035 1222.5978 1243.1991 1249.5300 1274.7660 1285.4131 1289.1696 1301.3049 1315.0504 1325.7070 1348.3063 1414.8798 1420.6319 1426.8766 1436.3906 1446.7386 1448.3603 1456.8862 1464.6375 1465.5208 1473.4372 1482.1383 1482.2878 1483.2716 1496.5296 1659.3242 2269.2285 2960.9993 2966.6870 2988.5942 2996.9034 2998.9988 3013.8637 3017.6644 3023.0374 3023.9988 3028.3638 3061.7147 3066.5239 3071.2319 3092.2067 3138.6070 3142.2174 3143.1413 3146.2759 3147.2196 3151.1959
redmass: 3.0917 3.8573 3.4725 2.6767 3.7181 3.1671 1.1589 2.6638 2.4579 3.5818 1.0364 1.1276 2.6324 3.5028 2.1153 2.1326 3.8874 3.9864 2.8538 2.2870 3.6521 2.7410 3.0541 5.1378 2.5898 4.5326 2.5203 3.0643 2.2600 3.0711 2.1715 2.5881 1.8205 2.0178 1.6455 2.4300 1.6183 1.8725 2.3938 1.1999 1.3362 1.3302 2.1020 1.7250 2.4770 1.4243 1.2672 2.3026 1.4924 1.4792 1.7942 1.8574 1.2335 1.3792 1.5567 1.3400 1.3137 1.4568 1.5894 1.4673 1.1370 1.1447 1.0762 1.0857 1.1036 1.0492 1.1306 1.0445 1.0423 1.0858 1.0532 1.0602 1.0928 1.0522 12.3861 11.6960 1.0652 1.0757 1.0644 1.0658 1.0578 1.0655 1.0975 1.0320 1.0318 1.0332 1.1063 1.0995 1.0950 1.1026 1.1052 1.1056 1.1053 1.1056 1.1053 1.1051
irintensity: 0.5452 0.2968 0.1735 1.8349 2.7890 3.4194 1.0062 8.9955 6.8533 8.9734 0.4246 3.6290 6.2393 2.2059 0.2347 0.8254 1.9099 2.2023 3.9906 0.0458 4.6922 4.1558 1.0911 7.2093 2.2478 14.8378 1.0935 5.7568 41.3035 71.3052 10.4201 13.0423 1.1504 12.7845 10.1185 19.6761 2.7608 11.4737 4.2891 0.0470 1.9286 0.6604 30.6743 0.1651 46.0191 23.0529 0.6281 4.6763 3.6390 6.8336 3.3745 0.9357 10.8654 3.5240 1.2545 3.0268 1.6133 5.2727 5.3533 48.4543 16.3429 20.7370 26.0342 19.0548 6.4955 0.3240 14.7242 1.0581 1.7908 10.0776 45.2126 51.9226 7.7106 80.4347 160.4825 217.1484 10.8648 16.0589 39.1359 6.5347 18.2490 24.7486 6.5839 2.9797 4.3258 5.0228 1.1390 32.0153 5.0107 28.0462 0.1908 1.1768 3.3799 1.6829 6.3960 2.9497
temp: 298.150 k
press: 1.00000 atm
elementType: 8 7 6 6 6 6 6 6 6 6 6 6 6 6 1 1 1 1 1 1 1 1 1 1 1 1 1 1 1 1 1 1 1 1
symmnumber: 1
zpe: 780533.7 jmol-1
zpe.correction: 0.297290 hartree
zpe.thermalcorrener: 0.312504 hartree
zpe.thermalcorrenthalpy: 0.313448 hartree
zpe.thermalcorrgfe: 0.254061 hartree
zpe.sumelectzpe: -597.840072 hartree
zpe.sumelectthermal: -597.824858 hartree
zpe.sumelectthermalent: -597.823914 hartree
zpe.sumelectthermalfe: -597.883301 hartree
dipole: -14.4048 3.5092 0.2560
dipole: 14.8283
quadrupole: -8.8619 -81.8324 -75.0887
quadrupole: 9.9862 1.2118 -0.4022
quadrupole: 46.3991 -26.5714 -19.8277 9.9862 1.2118 -0.4022
hfenergy: -598.1373619 hartree
pointgroup: C01 [X(C12H20N1O1)]
dipole: 5.6402444 1.3103415 0.7106949 debye
polarizability: 187.6063055|-0.6830714|114.1295848|9.5026201|8.1100855|106.5485667 unknown
InChI: InChI=1S/C12H20NO/c1-13(2,3)10-5-4-7-11-8-6-9-12(11)14/h11H,6-10H2,1-3H3
charge 1 multiplicity 1
34 atoms
O  -3.836715 -1.55907 -1.051543
N  3.791224 0.300216 0.042816
C  -2.127164 -0.145773 0.056659
C  -2.220652 1.374128 0.334757
C  -3.673598 1.561401 0.869876
C  -4.527285 0.583029 0.022686
C  -3.560016 -0.52208 -0.406314
C  -1.082232 -0.647318 -0.970948
C  2.829285 -0.88999 0.404341
C  3.257679 1.591191 0.657467
C  5.173481 -0.011992 0.6071
C  3.871984 0.446513 -1.474843
C  0.302747 -0.666159 -0.486793
C  1.476259 -0.702167 -0.099169
H  -1.969815 -0.679275 1.019006
H  -2.09077 1.937814 -0.610836
H  -1.461013 1.732932 1.050388
H  -4.016539 2.605436 0.78754
H  -3.720258 1.281168 1.938584
H  -4.916803 1.067929 -0.894789
H  -5.402678 0.160923 0.545871
H  -1.375431 -1.67345 -1.278059
H  -1.13999 -0.028887 -1.889257
H  3.304491 -1.794563 -0.018815
H  2.851564 -0.967434 1.50712
H  2.239564 1.765127 0.279556
H  3.235062 1.485075 1.752996
H  3.920152 2.423133 0.373747
H  5.856647 0.817668 0.370505
H  5.100935 -0.132555 1.699001
H  5.549631 -0.941805 0.153225
H  2.861104 0.633292 -1.865235
H  4.539186 1.287819 -1.717004
H  4.268967 -0.485575 -1.905434
