program: Gaussian 09
title: 000249860
version: EM64L-G09RevD.01
frameworkgroup: C1[X(C12H20N2O2)]
method: RPBEPBE
basis: SDD
operation: Freq
keyword: #p
keyword: freq=noraman
keyword: PBEPBE/SDD
title: #p freq=noraman PBEPBE/SDD
converged: YES YES NO NO
title: Mulliken charges:
elementType: O O N N C C C C C C C C C C C C H H H H H H H H H H H H H H H H H H H H
charge: -0.220718 -0.230335 -0.450134 -0.410899 -0.066698 0.235990 -0.472049 -0.510129 -0.020382 -0.451124 -0.420676 0.118086 -0.392570 -0.772841 0.140917 -0.716848 0.263631 0.209946 0.241115 0.224222 0.195660 0.197335 0.215446 0.215512 0.218376 0.211796 0.313986 0.220322 0.222491 0.267469 0.214949 0.218741 0.343102 0.223970 0.207212 0.215130
chargesum: 0.00000
title: Mulliken charges with hydrogens summed into heavy atoms:
elementType: O O N N C C C C C C C C C C C C
charge: -0.220718 -0.230335 -0.136148 -0.067797 0.196933 0.235990 -0.020988 -0.090248 0.176953 -0.020166 0.009497 0.118086 0.050242 -0.071681 0.140917 -0.070537
polarizability: 1.45701687e+02 4.83400468e+00 1.50751777e+02 -1.36140307e-01 -5.34947734e+00 1.29786124e+02
1716.lowfreq: -10.3821 0.0006 0.0008 0.0009 6.0482 10.2677 22.5259 57.2012 67.0405
frequency: 21.8868 57.1442 66.9908 79.2612 100.2786 100.8141 118.6669 152.4923 162.2241 186.3183 211.7816 247.6496 261.5213 282.9164 300.9800 328.1857 355.8327 395.3957 425.5596 449.1913 497.9484 543.7012 603.6449 605.1148 618.3756 656.8163 679.0186 704.6164 732.9571 767.8515 775.4508 779.8642 822.7412 848.9612 881.8898 899.0076 936.6521 952.3333 964.7737 970.3666 977.7579 986.1597 1000.9757 1028.1769 1043.0320 1062.4636 1097.1869 1104.5304 1131.5954 1153.6908 1172.3937 1178.3298 1184.9341 1197.1052 1208.8052 1245.2422 1264.2557 1268.3055 1284.2882 1290.6576 1297.3570 1306.6263 1310.7916 1311.3750 1317.9895 1323.3879 1339.4046 1340.6124 1368.1530 1390.2668 1400.3586 1464.8638 1468.7445 1472.7882 1474.4212 1474.6647 1481.2988 1486.2321 1491.8251 1494.2747 1668.1497 1716.5050 2949.4703 2974.4584 2976.7153 2978.1826 2990.3987 2992.0934 2996.2969 3009.1580 3012.7066 3033.0301 3042.7986 3058.8141 3063.7281 3070.5850 3077.7452 3080.9847 3083.8642 3092.2528 3584.8786 3605.5376
redmass: 1.8908 4.1054 4.1678 1.7974 2.6937 3.1533 3.4957 3.1454 6.1135 1.4134 1.2752 1.9063 3.7155 3.7079 3.8118 3.1965 3.4310 5.1531 2.2688 1.4664 1.7976 3.5869 6.1193 2.8484 3.2745 1.3868 3.8942 6.6520 5.1733 1.3544 1.4323 2.3179 1.8829 2.0549 3.1939 2.3666 2.0910 1.5839 2.3441 1.8569 1.5026 1.3385 1.9084 2.2719 2.8621 2.8403 2.8982 2.4555 3.2397 2.0488 2.1178 1.7180 1.5612 1.7507 2.2475 1.1829 1.2695 1.2943 1.2828 1.2343 1.5951 1.6562 1.2648 1.6358 1.7949 1.8676 1.4952 1.6043 1.6130 1.2160 1.1985 1.0801 1.0638 1.0870 1.0814 1.0485 1.0613 1.0585 1.0989 1.0457 8.3994 9.1847 1.0818 1.0648 1.0369 1.0606 1.0625 1.0363 1.0622 1.0756 1.0702 1.1000 1.0980 1.0989 1.1031 1.0996 1.0996 1.1045 1.0983 1.1001 1.0802 1.0795
irintensity: 0.0258 0.0382 0.0614 0.1134 0.3430 0.2711 1.2141 0.9980 1.8564 0.2532 0.1045 0.2009 1.3045 1.3430 2.0650 0.9502 1.6049 14.0567 9.5734 76.0376 47.9146 5.3054 11.7568 3.7497 19.5122 111.2958 13.3142 15.6595 58.0912 1.6990 2.8112 8.9869 2.2258 0.6346 0.5799 5.4257 7.8449 1.6168 8.1854 14.1694 10.9770 2.3388 13.0757 2.3068 3.3860 2.9557 5.0687 10.3134 13.0347 3.2451 3.0624 3.5840 7.8577 20.5824 47.4343 0.9600 1.1800 3.0897 4.8378 6.2315 46.8402 45.2360 6.9179 4.9610 40.3590 73.1158 1.1692 11.3920 1.7257 12.0445 27.8509 1.8294 3.2532 6.2110 6.0624 14.1682 1.5313 17.5773 4.2674 10.4515 419.5406 461.3765 17.5823 32.8800 34.1697 32.6880 21.8400 21.3416 36.8548 31.6362 34.4198 7.0152 22.8513 10.4935 13.0182 41.1002 45.1832 108.3185 26.7595 16.6690 69.1691 30.3076
temp: 298.150 k
press: 1.00000 atm
elementType: 8 8 7 7 6 6 6 6 6 6 6 6 6 6 6 6 1 1 1 1 1 1 1 1 1 1 1 1 1 1 1 1 1 1 1 1
symmnumber: 1
zpe: 810475.1 jmol-1
zpe.correction: 0.308694 hartree
zpe.thermalcorrener: 0.325437 hartree
zpe.thermalcorrenthalpy: 0.326382 hartree
zpe.thermalcorrgfe: 0.263807 hartree
zpe.sumelectzpe: -728.019231 hartree
zpe.sumelectthermal: -728.002487 hartree
zpe.sumelectthermalent: -728.001543 hartree
zpe.sumelectthermalfe: -728.064118 hartree
dipole: -1.1330 -2.9732 -1.2729
dipole: 3.4269
quadrupole: -93.7731 -105.7274 -104.5696
quadrupole: -1.9673 1.3630 9.0709
quadrupole: 7.5836 -4.3707 -3.2129 -1.9673 1.3630 9.0709
hfenergy: -728.3279247 hartree
pointgroup: C01 [X(C12H20N2O2)]
dipole: 0.5158474 -1.1689115 0.4305193 debye
polarizability: 146.0853327|-4.7807006|149.7922051|-1.2096098|6.4028968|130.3620504 unknown
InChI: InChI=1S/C12H20N2O2/c1-3-8(2)12(9-6-4-5-7-9)10(15)13-11(16)14-12/h8-9,13-14H,3-7H2,1-2H3
charge 0 multiplicity 1
36 atoms
O  -0.741967 0.463894 -2.385851
O  -1.010476 3.107435 1.508488
N  -0.300207 0.861178 1.13544
N  -1.006216 2.032535 -0.631647
C  1.319596 -0.487853 -0.250382
C  -0.169094 -0.090515 0.006305
C  2.296851 0.700086 -0.44809
C  1.98205 -1.309954 0.892718
C  -1.110674 -1.343157 0.224181
C  3.688362 0.027029 -0.353965
C  3.523454 -1.100798 0.717973
C  -0.669223 0.790778 -1.17563
C  -2.602073 -0.921406 0.357699
C  -0.931843 -2.419786 -0.87362
C  -0.789495 2.108359 0.782899
C  -3.495391 -2.008331 0.994359
H  1.326531 -1.084089 -1.183157
H  2.168359 1.437465 0.368458
H  2.142298 1.223947 -1.408107
H  1.698415 -2.376863 0.86301
H  1.661755 -0.91807 1.879016
H  -0.797616 -1.778694 1.198685
H  4.48657 0.7433 -0.091266
H  3.954472 -0.414774 -1.332756
H  4.021799 -2.031904 0.394316
H  3.985243 -0.807295 1.67782
H  -0.078323 0.635241 2.102831
H  -2.994859 -0.661082 -0.645748
H  -2.670965 -0.007017 0.977804
H  -1.095691 -1.985623 -1.875511
H  -1.661853 -3.234675 -0.724771
H  0.07304 -2.87635 -0.854763
H  -1.361589 2.824681 -1.167755
H  -4.533765 -1.646002 1.103489
H  -3.128945 -2.284267 2.001736
H  -3.529528 -2.928724 0.38399
