program: Gaussian 09
title: 000249855
version: EM64L-G09RevD.01
frameworkgroup: C1[X(C10H16N2O2)]
method: RPBEPBE
basis: SDD
operation: Freq
keyword: #p
keyword: freq=noraman
keyword: PBEPBE/SDD
title: #p freq=noraman PBEPBE/SDD
converged: YES YES NO NO
title: Mulliken charges:
elementType: O O N N C C C C C C C C C C H H H H H H H H H H H H H H H H
charge: -0.215736 -0.231862 -0.446951 -0.408654 -0.053756 0.226313 -0.471326 -0.478667 -0.437961 -0.435795 -0.404679 0.124661 0.153675 -0.705586 0.252283 0.212645 0.245598 0.227216 0.192795 0.223825 0.205837 0.217978 0.211905 0.223018 0.230017 0.316437 0.345421 0.222912 0.237551 0.220884
chargesum: 0.00000
title: Mulliken charges with hydrogens summed into heavy atoms:
elementType: O O N N C C C C C C C C C C
charge: -0.215736 -0.231862 -0.130513 -0.063234 0.198528 0.226313 -0.013082 -0.058656 -0.008299 -0.005912 0.048355 0.124661 0.153675 -0.024238
polarizability: 1.27061791e+02 8.39620509e+00 1.20836755e+02 -6.47402790e-01 4.99003036e+00 1.12687244e+02
1716.lowfreq: -11.4500 -0.0007 -0.0007 -0.0005 7.1617 8.7911 44.1461 68.4338 79.5231
frequency: 44.0206 68.4183 79.5127 101.2457 124.3293 150.6121 163.4078 190.3258 226.4352 269.4499 278.4672 305.9310 337.0746 387.8216 459.6594 497.8945 521.2684 579.0219 601.7762 617.2853 625.7889 658.9304 705.2713 731.8363 740.3576 784.9760 804.0487 848.7633 871.5227 901.8410 927.4165 947.8864 958.7830 971.0096 993.1296 1002.2540 1041.2525 1062.1868 1086.8243 1091.6845 1125.2220 1135.3408 1172.9858 1185.2869 1202.2340 1217.0945 1241.9889 1268.5888 1274.8416 1293.7435 1299.0527 1306.2924 1308.5001 1311.7386 1319.3857 1321.1924 1342.4728 1365.0435 1393.2630 1460.4963 1469.0231 1470.5570 1474.9395 1479.5663 1486.2526 1489.7391 1674.9462 1717.9363 2981.3379 2985.9486 2986.0610 2991.8878 2993.3113 2995.5113 3004.7148 3043.3329 3048.7903 3060.5892 3063.9860 3078.5386 3082.7073 3086.1600 3586.9016 3608.7468
redmass: 2.8788 4.3473 2.7227 2.3500 3.9218 3.1643 5.8722 1.6302 1.6317 2.0780 3.7427 3.4811 3.7924 6.8929 1.2844 1.9068 3.4957 2.4279 6.0024 4.0448 2.4483 1.5234 6.7912 4.0332 2.4824 1.3127 1.7266 2.0096 3.0843 2.4900 2.1603 1.7043 2.3459 2.1262 1.7400 1.4584 2.4438 1.9703 3.0923 2.5686 2.3798 2.3256 1.5902 2.0177 1.7408 2.0522 1.2483 1.2507 1.3290 1.2074 1.6367 1.7024 1.3661 1.5647 2.8029 1.4972 1.5664 1.6585 1.2182 1.0852 1.0886 1.0810 1.0873 1.0422 1.0512 1.1004 8.3762 9.3992 1.0629 1.0398 1.0641 1.0647 1.0613 1.0750 1.0652 1.0986 1.1006 1.0983 1.1024 1.1045 1.0993 1.1009 1.0802 1.0794
irintensity: 0.1020 0.2227 0.0649 0.1326 2.0212 1.1355 0.9389 0.5124 0.5206 0.8088 3.8987 0.7529 2.2808 12.8120 89.3726 31.3304 7.0729 0.5103 14.3091 9.3009 31.1472 111.2718 18.4919 34.8598 22.5599 11.6181 1.0614 2.4424 3.0148 3.0757 6.8197 4.2123 2.0353 20.3717 2.3409 9.8480 2.1046 3.6154 6.3021 1.2739 24.2357 6.3238 1.9030 2.1201 20.8709 35.2973 8.9438 2.2358 2.3750 10.2684 48.2184 51.4885 3.3655 9.1840 104.9080 4.2628 6.1274 6.9774 11.6639 5.8178 6.0294 5.8844 11.2195 13.0083 10.3271 2.9463 475.8669 406.0439 48.4291 14.1708 24.7416 29.6773 12.3541 28.6628 45.3201 11.7932 3.7161 23.1778 23.5008 77.6730 36.5180 36.6651 67.4593 31.6815
temp: 298.150 k
press: 1.00000 atm
elementType: 8 8 7 7 6 6 6 6 6 6 6 6 6 6 1 1 1 1 1 1 1 1 1 1 1 1 1 1 1 1
symmnumber: 1
zpe: 664920.2 jmol-1
zpe.correction: 0.253255 hartree
zpe.thermalcorrener: 0.267061 hartree
zpe.thermalcorrenthalpy: 0.268005 hartree
zpe.thermalcorrgfe: 0.212631 hartree
zpe.sumelectzpe: -649.575398 hartree
zpe.sumelectthermal: -649.561592 hartree
zpe.sumelectthermalent: -649.560648 hartree
zpe.sumelectthermalfe: -649.616022 hartree
dipole: 2.4255 2.1221 -1.3331
dipole: 3.4876
quadrupole: -84.2404 -89.4072 -90.5752
quadrupole: -3.7797 -2.9418 -9.7412
quadrupole: 3.8339 -1.3330 -2.5009 -3.7797 -2.9418 -9.7412
hfenergy: -649.8286529 hartree
pointgroup: C01 [X(C10H16N2O2)]
dipole: 1.0087742 -0.7877451 0.4945721 debye
polarizability: 127.8413765|-7.9016167|120.1056587|-0.0536433|5.2494719|112.6387551 unknown
InChI: InChI=1S/C10H16N2O2/c1-2-10(7-5-3-4-6-7)8(13)11-9(14)12-10/h7,11-12H,2-6H2,1H3
charge 0 multiplicity 1
30 atoms
O  -1.21315 -0.586519 -2.235967
O  -2.101618 2.326656 1.367316
N  -0.671603 0.430652 1.141689
N  -1.869972 1.047759 -0.644631
C  1.222315 -0.453032 -0.29595
C  -0.287275 -0.548067 0.099931
C  1.686751 0.945064 -0.787836
C  2.218909 -0.824549 0.855465
C  3.224843 0.873969 -0.646786
C  3.430179 0.156189 0.716022
C  -0.671254 -2.008861 0.484759
C  -1.161239 -0.067782 -1.094866
C  -1.593934 1.377442 0.723762
C  -2.157941 -2.213115 0.839025
H  1.353104 -1.16725 -1.133239
H  1.284374 1.736649 -0.125068
H  1.353863 1.159086 -1.818682
H  2.5375 -1.878629 0.773002
H  1.750001 -0.717043 1.853429
H  3.707948 1.866408 -0.681955
H  3.649746 0.266676 -1.469607
H  4.401072 -0.366624 0.775006
H  3.410809 0.901081 1.533426
H  -0.034516 -2.318809 1.335844
H  -0.400171 -2.652358 -0.373678
H  -0.301468 0.437566 2.089827
H  -2.52754 1.587934 -1.207463
H  -2.473669 -1.549338 1.663857
H  -2.810623 -2.015998 -0.030492
H  -2.335236 -3.25596 1.15716
