program: Gaussian 09
title: 000249831
version: EM64L-G09RevD.01
frameworkgroup: C1[X(C15H20O4)]
method: RPBEPBE
basis: SDD
operation: Freq
keyword: #pfreq=noraman
keyword: PBEPBE/SDD
title: #p freq=noraman PBEPBE/SDD
converged: YES YES NO NO
title: Mulliken charges:
elementType: O O O O C C C C C C C C C C C C C C C H H H H H H H H H H H H H H H H H H H H
charge: -0.275108 -0.305105 -0.304761 -0.257727 -0.354415 -0.345788 -0.299760 -0.689255 0.377512 0.066332 0.206737 -0.397850 -0.248827 -0.351740 -0.229561 0.217658 -0.358296 -0.526435 -0.527917 0.202087 0.230163 0.191399 0.202453 0.217604 0.224562 0.216849 0.215340 0.210483 0.236137 0.294203 0.254875 0.231325 0.245566 0.255843 0.235132 0.228796 0.223745 0.231128 0.256618
chargesum: 0.00000
title: Mulliken charges with hydrogens summed into heavy atoms:
elementType: O O O O C C C C C C C C C C C C C C C
charge: -0.275108 -0.305105 -0.304761 -0.257727 0.077835 0.048063 0.142405 -0.046583 0.377512 0.066332 0.206737 -0.161713 0.045376 -0.096865 0.001764 0.217658 -0.112730 0.193336 0.183575
polarizability: 3.13844500e+02 2.05880056e+00 1.80487792e+02 -1.30317495e+01 9.31625067e+00 1.11035898e+02
1716.lowfreq: -7.3111 -5.7915 -0.0008 -0.0006 0.0004 1.3050 12.9338 24.5377 40.3155
frequency: 11.4185 24.3963 40.3033 51.0489 63.8363 67.3696 84.9437 102.5665 107.5488 123.1248 151.8616 159.9322 163.0957 166.0070 201.7033 213.7533 226.3514 230.6050 254.9670 273.8399 302.7747 348.6088 366.4258 388.0867 412.4655 444.6005 503.3011 535.8920 552.7058 575.9031 594.2047 641.4158 687.6402 708.7689 744.1911 752.7394 779.1286 803.7793 812.0827 870.3623 891.9699 898.1943 904.8196 909.2923 937.4746 945.9165 970.0890 973.0761 996.8155 1033.2681 1033.8150 1067.3833 1074.7666 1110.6104 1112.3289 1115.0055 1124.8610 1145.9216 1153.9892 1165.5854 1167.5274 1186.5888 1227.5279 1235.5664 1257.1391 1272.1007 1288.2027 1289.8040 1291.1369 1308.9018 1346.3339 1366.4707 1370.7906 1387.6693 1411.8836 1428.6188 1442.8887 1451.0297 1458.5192 1460.8950 1463.6241 1471.2400 1474.7284 1476.7381 1478.2412 1486.2856 1489.1481 1574.8751 1591.4415 1609.6838 1641.8707 2966.9312 2974.6999 2974.7491 2977.8142 2991.6579 3012.5251 3016.7899 3051.7342 3072.7311 3073.0241 3074.3825 3076.8692 3096.4591 3124.0889 3127.1253 3132.5814 3138.1663 3153.7519 3157.9682 3171.8204
redmass: 3.8181 4.4902 3.8107 2.5995 4.9883 2.4184 3.3477 2.6915 2.5039 4.0423 2.3615 1.7222 1.8453 1.1658 3.4664 3.2592 1.2504 3.8275 4.2280 3.6978 3.8580 4.9789 4.5751 4.3152 3.3377 5.6141 6.0682 4.5031 4.6424 4.3240 4.2141 5.7852 6.7019 4.4493 1.0783 1.8458 5.3200 1.2232 2.5321 6.4744 1.9084 1.8834 1.6317 3.3495 1.3169 8.1907 4.2961 1.3500 5.1459 1.1678 3.8800 2.0068 2.4342 2.3173 1.3266 1.2423 2.8317 1.4167 1.3491 1.7594 2.3767 1.3200 1.3180 2.4513 1.6963 1.2772 1.5629 1.2615 1.0766 1.8244 1.4499 2.5341 2.1115 1.2171 1.6460 1.2895 1.7027 1.1129 1.0671 1.2298 1.7230 1.0659 1.0467 1.0679 1.0603 1.0524 1.0869 6.6598 6.4881 10.0616 5.7981 1.0587 1.0348 1.0326 1.0306 1.0603 1.0988 1.0582 1.1028 1.1011 1.1037 1.0996 1.1044 1.1082 1.1030 1.1030 1.0911 1.0861 1.0919 1.0904 1.0989
irintensity: 0.4983 0.4105 0.5985 0.6663 2.6774 1.7570 4.2308 6.9810 0.2566 0.2403 0.4182 1.5516 0.9912 0.0392 1.2671 6.9171 0.1860 4.7910 7.0841 4.7272 21.7649 0.2762 10.8738 5.0944 6.1082 8.8144 4.8217 3.2870 0.8312 9.2686 0.6406 6.1202 6.9794 35.8480 8.2724 31.9310 15.5294 1.3905 39.1781 9.4197 15.5000 11.4766 3.9607 10.4941 12.8189 53.8237 117.2425 0.4776 30.0296 36.7508 29.6357 37.6423 4.1018 284.1162 20.2867 4.4315 330.2368 2.8674 1.0577 11.0389 43.5794 18.1817 12.4464 163.0053 205.8236 9.9644 2.5282 4.0785 2.1654 20.8148 3.6792 23.7805 21.2273 9.1371 24.1638 6.4953 64.9382 21.3221 20.9548 2.8225 13.6275 0.4701 10.9792 4.3390 4.9692 21.7975 18.7089 28.9247 28.9441 256.2507 145.2769 34.6760 92.3400 25.6286 50.9505 19.5809 10.6799 61.1657 5.0693 58.3070 28.0396 57.2747 22.6868 43.9338 23.9894 16.6336 3.0628 4.9990 6.9976 8.2446 16.2448
temp: 298.150 k
press: 1.00000 atm
elementType: 8 8 8 8 6 6 6 6 6 6 6 6 6 6 6 6 6 6 6 1 1 1 1 1 1 1 1 1 1 1 1 1 1 1 1 1 1 1 1
symmnumber: 1
zpe: 836681.8 jmol-1
zpe.correction: 0.318675 hartree
zpe.thermalcorrener: 0.339852 hartree
zpe.thermalcorrenthalpy: 0.340797 hartree
zpe.thermalcorrgfe: 0.265457 hartree
zpe.sumelectzpe: -883.002380 hartree
zpe.sumelectthermal: -882.981203 hartree
zpe.sumelectthermalent: -882.980259 hartree
zpe.sumelectthermalfe: -883.055598 hartree
dipole: -1.2072 0.6724 0.6393
dipole: 1.5226
quadrupole: -93.5185 -105.0436 -115.3280
quadrupole: 5.1931 4.0842 -1.4244
quadrupole: 11.1115 -0.4136 -10.6979 5.1931 4.0842 -1.4244
hfenergy: -883.3210552 hartree
pointgroup: C01 [X(C15H20O4)]
dipole: -0.4745576 -0.3403135 -0.1334871 debye
polarizability: 313.3628199|2.8892842|176.2092645|16.1941292|-19.0919338|115.7961054 unknown
InChI: InChI=1S/C15H20O4/c1-4-5-11-19-14(16)10-9-12-7-6-8-13(17-2)15(12)18-3/h6-10H,4-5,11H2,1-3H3
charge 0 multiplicity 1
39 atoms
O  3.299971 -0.923995 1.073821
O  -2.354208 1.501673 -0.415698
O  -5.023064 0.414343 -0.631028
O  2.455446 1.18957 0.508877
C  5.37194 -0.294435 -0.176032
C  6.810762 0.259574 -0.05047
C  4.662684 -0.330022 1.18542
C  7.548112 0.295197 -1.406688
C  -1.51767 -0.696847 0.251225
C  -2.606419 0.138376 -0.151825
C  -3.927884 -0.386692 -0.234896
C  -1.789363 -2.068458 0.531552
C  -0.176258 -0.108787 0.346207
C  -4.162008 -1.752339 0.024619
C  -3.087959 -2.59263 0.403294
C  2.265866 -0.037169 0.718658
C  0.984315 -0.76629 0.65286
C  -2.571068 1.918236 -1.823565
C  -5.351777 1.528043 0.292023
H  5.39983 -1.316492 -0.601713
H  4.788792 0.338863 -0.870616
H  7.386165 -0.360987 0.666835
H  6.774084 1.282091 0.37688
H  5.183184 -0.992751 1.897305
H  4.572074 0.688254 1.60618
H  8.57209 0.697098 -1.297762
H  7.009292 0.932526 -2.132421
H  7.626525 -0.718379 -1.842756
H  -0.971522 -2.723881 0.847583
H  -0.10939 0.969341 0.152153
H  -5.185474 -2.130016 -0.064032
H  -3.27542 -3.651043 0.611686
H  1.032956 -1.839138 0.863933
H  -3.607023 1.702897 -2.14024
H  -2.375995 3.000908 -1.83895
H  -1.8548 1.396053 -2.484931
H  -5.665721 1.125005 1.2734
H  -6.191494 2.058883 -0.181335
H  -4.487375 2.20312 0.421847
