program: Gaussian 09
title: 000249819
version: EM64L-G09RevD.01
frameworkgroup: C1[X(C13H18O)]
method: RPBEPBE
basis: SDD
operation: Freq
keyword: #pfreq=noraman
keyword: PBEPBE/SDD
title: #p freq=noraman PBEPBE/SDD
converged: YES YES NO NO
title: Mulliken charges:
elementType: O C C C C C C C C C C C C C H H H H H H H H H H H H H H H H H H
charge: -0.470229 0.183071 -0.116242 -0.480797 -0.404190 -0.392871 -0.404020 0.379737 -0.757806 -0.392528 -0.422251 -0.248984 -0.223373 -0.246777 0.188761 0.229236 0.213170 0.187678 0.205222 0.226145 0.194942 0.186209 0.201590 0.224073 0.195025 0.244397 0.329916 0.224535 0.271832 0.223293 0.223769 0.227469
chargesum: 0.00000
title: Mulliken charges with hydrogens summed into heavy atoms:
elementType: O C C C C C C C C C C C C C
charge: -0.140313 0.183071 0.072519 -0.038391 -0.011289 0.028215 -0.016221 0.379737 -0.094311 -0.167993 -0.150419 -0.025692 0.000396 -0.019308
polarizability: 1.74612224e+02 -6.28050606e-01 1.12529364e+02 -3.79819636e-03 -1.14760881e+01 1.20744234e+02
1716.lowfreq: -14.2964 -8.3884 -0.0007 -0.0007 -0.0006 9.4972 34.3439 78.0805 104.8849
frequency: 33.8135 78.0587 104.8543 152.4985 198.0064 212.2462 243.2203 259.6486 279.9847 311.0697 320.7460 352.8984 374.0461 407.3021 413.2726 451.8545 472.0419 526.9014 565.6983 616.8393 620.6996 678.0987 710.2009 765.2154 792.3327 814.4155 858.3003 860.1715 876.5179 895.6868 928.2751 932.6175 964.7512 978.0388 982.8765 989.4452 998.3075 1002.9417 1029.1198 1045.0549 1073.8853 1091.5482 1098.5044 1104.3222 1142.8556 1159.0026 1171.1506 1189.6755 1196.7890 1226.5548 1252.8639 1263.1308 1276.2472 1290.3949 1313.4240 1334.4763 1335.1124 1341.2256 1343.3392 1349.4094 1378.3433 1386.2789 1432.6591 1447.1536 1450.1552 1461.5978 1468.0352 1476.5124 1478.6150 1485.2290 1588.4045 1610.4490 2959.1164 2966.2315 2972.6969 2976.3491 2982.8283 2990.7002 3025.6784 3035.1719 3044.7309 3054.3971 3059.3982 3079.3823 3118.5459 3126.0589 3139.3961 3151.3334 3163.3041 3544.2806
redmass: 3.7021 3.3932 3.0154 2.5398 2.5408 1.1267 3.8363 3.3684 2.9027 3.0113 1.2374 2.0817 2.4296 2.7103 3.1813 3.6789 2.3332 2.5253 2.5781 6.3416 3.8096 4.3845 1.7506 1.9047 1.8209 2.1006 1.3589 2.1464 1.5081 2.3288 1.5658 2.0173 2.5119 1.4625 1.4099 4.3771 1.5604 1.5212 2.1770 2.0297 1.7468 1.5234 2.0181 1.5406 2.2457 1.7195 1.0527 1.2126 2.4347 1.7499 1.3855 1.3700 1.3499 1.2759 1.3583 1.5106 1.4216 1.4787 1.5012 1.4847 5.9583 1.2472 2.2324 1.0892 1.0880 1.0833 1.0947 1.0489 2.1831 1.0527 6.0998 6.1041 1.0634 1.0401 1.0720 1.0663 1.0627 1.0637 1.0959 1.1023 1.0996 1.0960 1.1017 1.0995 1.0844 1.0873 1.0929 1.0945 1.1006 1.0652
irintensity: 0.4280 0.2069 0.4064 0.2135 0.2820 0.1574 0.9725 5.0001 9.9339 2.3467 102.8095 16.3554 31.0352 6.5805 0.4995 4.6726 3.2446 6.4629 13.2992 0.1477 7.1575 1.7464 49.6398 49.4418 1.1981 1.5932 3.1633 7.6145 14.1607 2.5751 9.2159 20.9853 24.6556 8.4714 0.8875 1.2600 11.1046 9.3926 11.9176 4.5499 6.0647 3.7580 19.6092 0.9087 6.0718 3.8094 0.1525 4.3366 6.3081 0.9193 7.6931 13.6854 19.5258 0.7886 0.6952 6.4131 1.0463 3.7165 2.3280 1.6714 1.3666 18.2498 9.2084 6.5259 9.5609 10.2204 8.7494 8.8947 19.2205 7.7735 0.9118 6.9603 38.1933 18.7367 13.2482 48.4779 35.8207 44.7166 67.5129 29.2618 22.0631 24.0866 77.3521 34.7987 4.6579 3.3037 32.0864 23.1514 23.0548 3.6702
temp: 298.150 k
press: 1.00000 atm
elementType: 8 6 6 6 6 6 6 6 6 6 6 6 6 6 1 1 1 1 1 1 1 1 1 1 1 1 1 1 1 1 1 1
symmnumber: 1
zpe: 727957.6 jmol-1
zpe.correction: 0.277264 hartree
zpe.thermalcorrener: 0.290412 hartree
zpe.thermalcorrenthalpy: 0.291356 hartree
zpe.thermalcorrgfe: 0.238189 hartree
zpe.sumelectzpe: -580.344931 hartree
zpe.sumelectthermal: -580.331783 hartree
zpe.sumelectthermalent: -580.330839 hartree
zpe.sumelectthermalfe: -580.384007 hartree
dipole: 0.2915 1.3335 -0.5624
dipole: 1.4763
quadrupole: -81.5452 -86.8896 -81.7428
quadrupole: -1.5899 1.4265 -0.5863
quadrupole: 1.8473 -3.4971 1.6497 -1.5899 1.4265 -0.5863
hfenergy: -580.6221955 hartree
pointgroup: C01 [X(C13H18O1)]
dipole: 0.1148407 -0.5405533 0.1787805 debye
polarizability: 174.6111774|0.6781617|114.4088758|0.119489|-11.982762|118.8657684 unknown
InChI: InChI=1S/C13H18O/c1-11-7-5-6-10-13(11,14)12-8-3-2-4-9-12/h2-4,8-9,11,14H,5-7,10H2,1H3
charge 0 multiplicity 1
32 atoms
O  -0.89069 0.718538 -1.628136
C  -0.606023 0.229101 -0.253621
C  -1.376076 -1.117604 -0.016004
C  -1.149485 1.350911 0.674509
C  -2.90792 -0.900382 -0.123478
C  -2.678429 1.53141 0.565758
C  -3.414622 0.199786 0.835341
C  0.91772 0.101997 -0.045329
C  -0.910726 -2.246641 -0.964939
C  1.462131 -0.625311 1.046231
C  1.812202 0.781519 -0.911643
C  2.857652 -0.685424 1.255018
C  3.209318 0.721262 -0.706431
C  3.740137 -0.015172 0.376418
H  -1.159882 -1.43373 1.025894
H  -0.624602 2.289202 0.415473
H  -0.869374 1.098346 1.716459
H  -3.421202 -1.860841 0.081773
H  -3.153871 -0.613315 -1.165253
H  -2.925249 1.887912 -0.451748
H  -3.009399 2.31045 1.279926
H  -3.240369 -0.114491 1.886234
H  -4.50739 0.333518 0.717462
H  -1.411055 -3.196442 -0.701601
H  -1.182139 -2.029279 -2.017605
H  0.180246 -2.411059 -0.912654
H  -0.572015 0.033888 -2.271077
H  0.798799 -1.149891 1.743655
H  1.39922 1.369214 -1.73824
H  3.256091 -1.254717 2.102812
H  3.881924 1.254008 -1.388774
H  4.823081 -0.062864 0.536977
