program: Gaussian 09
title: 000249811
version: EM64L-G09RevD.01
frameworkgroup: C1[X(C11H16O2)]
method: RPBEPBE
basis: SDD
operation: Freq
keyword: #pfreq=noraman
keyword: PBEPBE/SDD
title: #p freq=noraman PBEPBE/SDD
converged: YES YES NO NO
title: Mulliken charges:
elementType: O O C C C C C C C C C C C H H H H H H H H H H H H H H H H
charge: -0.275138 -0.443919 -0.091774 -0.282069 -0.690907 -0.698051 0.358292 0.361685 -0.376492 -0.338346 -0.399065 -0.352330 -0.441015 0.218334 0.208719 0.197513 0.212074 0.197581 0.245899 0.224090 0.213093 0.205672 0.249587 0.249200 0.232503 0.257715 0.227647 0.193801 0.335699
chargesum: 0.00000
title: Mulliken charges with hydrogens summed into heavy atoms:
elementType: O O C C C C C C C C C C C
charge: -0.275138 -0.108220 0.126561 0.124164 -0.035352 -0.055195 0.358292 0.361685 -0.126905 -0.089145 -0.166562 -0.094615 -0.019567
polarizability: 1.83371524e+02 -2.33606644e+00 1.19710547e+02 -4.16234833e+00 -6.03108966e+00 8.19420708e+01
1716.lowfreq: -4.3260 -0.0004 -0.0002 0.0003 4.0523 8.4564 32.3293 39.8188 56.3333
frequency: 32.0856 39.7897 56.2013 85.4431 109.0230 150.9543 194.0267 204.5817 236.3373 242.8911 262.4118 313.8432 365.9302 375.7314 407.5828 419.5053 427.3584 486.2197 510.3532 567.8141 631.0356 709.2487 751.9194 811.8292 816.2887 830.5786 836.5630 915.1210 919.8229 932.4983 945.0072 951.2482 960.0601 972.0073 974.9795 988.1741 1003.0257 1113.4281 1137.8883 1148.7664 1155.2701 1173.6229 1191.4413 1214.0765 1227.5428 1235.0018 1286.0142 1298.5194 1309.1519 1342.6583 1360.4876 1367.5413 1376.1875 1388.7736 1396.9318 1417.9038 1462.9119 1470.0151 1470.5469 1475.4795 1481.3545 1490.4000 1501.1399 1583.2150 1621.8846 2938.9531 2956.4647 2970.8056 2974.9363 2987.9768 3009.6952 3048.6761 3061.3506 3069.1807 3078.4700 3093.5182 3120.8367 3136.3901 3160.9969 3164.5716 3553.7739
redmass: 3.7263 3.6386 2.8925 3.8221 3.5444 2.8081 1.8709 1.4768 1.4186 2.6630 2.3509 2.2193 2.6698 1.5300 2.6706 2.5644 3.0337 3.2591 3.1340 4.2620 6.8941 3.4302 4.4445 3.4369 1.4098 1.6470 2.7448 1.4197 1.1934 1.5318 1.7036 2.2904 1.4177 1.7650 1.7664 4.3352 2.6501 1.3213 1.8757 1.7732 1.1104 1.2315 1.7452 2.2122 3.8792 1.3760 1.3308 1.3484 1.3080 1.4308 1.5852 1.3757 1.2194 2.2611 1.3309 3.4301 1.0767 1.0456 1.1024 1.0964 1.0517 1.0735 2.2885 7.1074 6.3555 1.0550 1.0676 1.0360 1.0384 1.0870 1.1029 1.0951 1.0992 1.0988 1.0988 1.0991 1.0894 1.0882 1.0948 1.0955 1.0661
irintensity: 2.8074 1.4546 0.5878 0.4645 0.2613 4.1788 1.3956 1.2663 0.7852 0.2616 8.0501 37.4991 19.0153 131.8088 1.4800 2.3197 16.3390 3.0566 13.9488 26.1695 0.2483 4.4611 13.7888 25.0999 10.6537 46.9673 7.4236 2.5285 2.7991 31.8662 22.2197 54.4880 8.8772 11.1823 2.2013 87.5508 3.4996 17.1698 1.7845 0.1506 14.6183 86.9915 4.3766 33.7461 234.6330 10.5488 5.5220 0.5062 3.4799 1.4580 40.1882 13.4290 24.0161 11.2984 26.8006 2.0851 17.5015 2.2046 11.1745 22.2454 13.3398 44.3641 79.9098 8.6180 80.3580 33.8148 72.5774 35.5357 30.4669 6.0101 44.5479 23.1627 21.6841 70.0012 52.4059 32.1132 17.3835 7.7692 15.9147 4.0295 4.6572
temp: 298.150 k
press: 1.00000 atm
elementType: 8 8 6 6 6 6 6 6 6 6 6 6 6 1 1 1 1 1 1 1 1 1 1 1 1 1 1 1 1
symmnumber: 1
zpe: 642766.9 jmol-1
zpe.correction: 0.244817 hartree
zpe.thermalcorrener: 0.258880 hartree
zpe.thermalcorrenthalpy: 0.259824 hartree
zpe.thermalcorrgfe: 0.202942 hartree
zpe.sumelectzpe: -578.196174 hartree
zpe.sumelectthermal: -578.182112 hartree
zpe.sumelectthermalent: -578.181168 hartree
zpe.sumelectthermalfe: -578.238049 hartree
dipole: 2.4030 -0.0621 -0.5775
dipole: 2.4722
quadrupole: -83.7629 -76.7548 -78.5225
quadrupole: -10.2208 3.0256 -0.2626
quadrupole: -4.0828 2.9253 1.1575 -10.2208 3.0256 -0.2626
hfenergy: -578.4409914 hartree
pointgroup: C01 [X(C11H16O2)]
dipole: 0.9464631 0.0348974 -0.2214113 debye
polarizability: 183.4804488|0.1624552|120.5839151|-3.6467914|-0.9628891|80.9597779 unknown
InChI: InChI=1S/C11H16O2/c1-9(2)8-13-11-5-3-10(7-12)4-6-11/h3-6,9,12H,7-8H2,1-2H3
charge 0 multiplicity 1
29 atoms
O  1.406164 0.634341 -0.056099
O  -4.821631 -1.233787 -0.319209
C  3.766044 0.057205 -0.138579
C  2.343828 -0.501512 0.022464
C  4.123428 1.023584 1.012968
C  4.77282 -1.113455 -0.231868
C  0.03623 0.370384 0.080766
C  -2.781935 0.058203 0.332672
C  -0.814593 1.500464 -0.004118
C  -0.518879 -0.919732 0.285799
C  -2.207775 1.338305 0.117321
C  -1.917913 -1.061916 0.409639
C  -4.285179 -0.111734 0.47812
H  3.788907 0.622312 -1.092019
H  2.111776 -1.22715 -0.785146
H  2.233324 -1.009318 1.004791
H  5.124545 1.465631 0.857227
H  4.13633 0.489221 1.983113
H  3.387193 1.842457 1.081594
H  5.79975 -0.728567 -0.364551
H  4.548035 -1.780974 -1.085014
H  4.761727 -1.722642 0.692753
H  -0.36521 2.4844 -0.16987
H  0.119657 -1.805627 0.350152
H  -2.857691 2.219345 0.044883
H  -2.35179 -2.056243 0.565072
H  -4.566322 -0.382685 1.511213
H  -4.800416 0.838328 0.22139
H  -4.513429 -1.126237 -1.255163
