program: Gaussian 09
title: 000249773
version: EM64L-G09RevD.01
frameworkgroup: C1[X(C9H11N3)]
method: RPBEPBE
basis: SDD
operation: Freq
keyword: #pfreq=noraman
keyword: PBEPBE/SDD
title: #p freq=noraman PBEPBE/SDD
converged: NO NO NO NO
title: Mulliken charges:
elementType: N N N C C C C C C C C C H H H H H H H H H H H
charge: -0.243013 -0.135325 -0.112395 0.244562 0.038800 -0.485530 0.325515 -0.214313 -0.350607 -0.213443 -0.674666 -0.772771 0.257322 0.211175 0.253542 0.245237 0.230061 0.214271 0.226555 0.242909 0.212729 0.249423 0.249962
chargesum: 0.00000
title: Mulliken charges with hydrogens summed into heavy atoms:
elementType: N N N C C C C C C C C C
charge: -0.243013 -0.135325 -0.112395 0.244562 0.038800 -0.017033 0.325515 0.039229 -0.105370 0.016617 0.009070 -0.060657
polarizability: 1.54185698e+02 -5.44815986e+00 1.29455439e+02 -5.80383838e+00 -1.82536799e+00 6.38326372e+01
1716.lowfreq: -10.8407 -0.0007 -0.0004 -0.0002 8.3007 12.4592 75.6311 87.3854 95.1489
frequency: 75.6042 87.3234 95.1425 165.9610 178.8163 213.6604 236.6614 255.6762 298.1550 402.4830 488.0930 498.4996 516.4437 555.9768 582.4489 659.0433 673.3728 707.5449 745.0163 770.7929 786.2774 860.6937 875.2586 940.6781 944.6827 958.3287 989.6974 1019.3862 1048.0954 1049.8948 1065.9180 1077.1822 1152.1408 1159.1970 1224.3020 1257.5840 1292.6012 1305.3942 1316.2076 1368.4012 1391.8202 1401.0730 1427.0283 1450.9091 1459.1678 1459.9297 1465.0682 1477.6673 1489.7445 1497.3557 1553.5856 1621.0713 2982.6869 2987.5976 2989.7418 3066.5695 3070.9922 3086.7774 3098.1159 3102.2398 3148.0870 3170.7831 3195.0477
redmass: 2.6621 2.7519 1.1057 2.0022 2.3698 3.5679 1.8860 3.3516 2.3183 4.5381 4.3260 5.5311 3.5498 3.9268 3.8530 5.0375 7.4695 4.5938 1.6860 2.8224 1.3397 4.7832 1.3058 3.7813 1.3162 2.5878 3.3039 3.4065 1.5358 1.9062 1.7693 1.6996 4.4621 1.3290 1.8467 2.2500 2.0598 2.2862 1.4073 2.5414 1.2185 1.2621 2.6821 1.0440 1.4891 1.5995 1.6789 1.0580 1.2595 2.5361 6.0095 6.1730 1.0662 1.0363 1.0362 1.0958 1.0967 1.0980 1.1011 1.1008 1.0899 1.0899 1.1001
irintensity: 0.3304 1.7248 2.4725 2.8399 3.2376 0.1533 2.0465 0.9236 1.0040 1.9507 1.9081 0.9664 0.0593 0.7656 0.6190 1.6771 1.4092 0.9397 60.1951 17.1499 2.2741 4.5397 3.1156 1.8020 0.0707 11.7632 8.7596 0.4241 9.6079 14.3348 8.0520 9.0900 6.1833 6.5139 2.7812 3.7831 17.8942 5.8668 2.7833 22.8031 9.6247 24.0365 8.6979 14.4328 9.6166 2.4701 6.5205 13.0015 17.4732 13.2291 17.4022 4.5721 30.9679 28.7314 15.8225 4.0328 10.2540 49.0021 24.9886 19.4714 10.4459 4.3323 7.8002
temp: 298.150 k
press: 1.00000 atm
elementType: 7 7 7 6 6 6 6 6 6 6 6 6 1 1 1 1 1 1 1 1 1 1 1
symmnumber: 1
zpe: 487428.6 jmol-1
zpe.correction: 0.185652 hartree
zpe.thermalcorrener: 0.196513 hartree
zpe.thermalcorrenthalpy: 0.197457 hartree
zpe.thermalcorrgfe: 0.149038 hartree
zpe.sumelectzpe: -512.919618 hartree
zpe.sumelectthermal: -512.908757 hartree
zpe.sumelectthermalent: -512.907813 hartree
zpe.sumelectthermalfe: -512.956232 hartree
dipole: -0.1407 5.5706 -0.0808
dipole: 5.5730
quadrupole: -58.0428 -78.1983 -72.9843
quadrupole: 2.6459 -1.3850 -1.1892
quadrupole: 11.6990 -8.4565 -3.2425 2.6459 -1.3850 -1.1892
hfenergy: -513.1052701 hartree
pointgroup: C01 [X(C9H11N3)]
dipole: 0.1939171 2.1816852 -0.1004388 debye
dipolederiv: -0.1686116 0.2809098 0.0331507 -0.1578577 -0.4718183 0.0278668 0.0269096 -0.0271895 0.05651 -0.0648395 -0.2377739 -0.0160754 -0.0134266 -0.0607361 0.00693 -0.0215733 0.0261341 -0.2522918 -0.473399 0.135984 -0.0090003 -0.3153825 -0.2984623 0.0285486 0.035463 -0.0143551 -0.2302435 0.4435862 -0.0491635 -0.0253842 -0.0010096 0.0239999 -0.0145943 -0.0440282 0.0231342 -0.0147378 -0.1748919 0.000791 0.0170226 0.3550144 0.3463309 -0.0192907 0.0304166 -0.0038448 0.0632044 0.1161979 0.0173699 0.0032209 0.0594154 0.0807152 0.0550262 -0.0878003 0.0437211 0.1271116 0.2888814 -0.1754676 -0.0297443 -0.2652784 0.2332546 0.0294048 -0.0367373 0.0168 0.0068586 0.0422143 0.047177 -0.0134746 0.1527384 0.1504369 -0.0222692 -0.0186555 -0.0071142 -0.1104114 -0.0146973 -0.040538 -0.0271051 0.2000775 -0.1593059 -0.0210326 -0.0171555 0.004661 -0.1729027 0.0340021 -0.0059486 -0.0183318 -0.1156682 0.0972247 0.0134587 -0.0257913 -0.0025411 -0.1591051 -0.0179904 0.0101826 -0.0197171 0.047535 0.0572313 0.0047317 0.0540112 0.016873 -0.0049695 0.0055448 0.0871244 0.0029173 0.191349 -0.1126565 -0.0223744 0.0039531 -0.0091771 0.0395598 0.0124409 -0.0377724 0.0266271 -0.1027364 -0.0007867 0.0820715 0.0162734 0.0477037 0.0607089 0.0123499 -0.0122136 -0.0465392 0.0819284 -0.0281545 -0.1376207 -0.0055995 -0.0881376 -0.0545241 0.0001767 0.0806278 0.0221548 0.0404079 0.04347 0.0010664 0.0276655 -0.0044524 0.1787375 -0.0911151 -0.0550387 0.029014 -0.0434194 0.0808829 0.0049773 0.0301146 0.007806 0.156719 0.0917526 -0.0214118 0.0079724 -0.0165131 -0.0887622 0.0004812 0.0090208 0.0028995 0.1636684 0.0237179 -0.1283256 0.0562811 -0.1012595 -0.0448908 0.0840413 0.0362795 0.045512 0.0350615 -0.1941871 0.0983154 0.0056246 0.131049 0.0651341 0.0071488 0.0033665 -0.0056458 0.07061 0.1153687 0.0179645 -0.0056845 -0.0356197 -0.0213617 -0.1189534 -0.0239129 -0.0737003 -0.0338224 -0.1188708 -0.028881 0.0260652 -0.1432 0.0308396 0.0164659 0.0275034 0.0034152 0.106915 0.0629348 -0.0039598 -0.0490872 0.0154308 0.0381082 -0.09223 0.0046432 -0.1038188 -0.0134556 0.0694346 0.0200481 0.0300933 0.0364253 0.0393068 0.0861462 -0.0243664 0.1013167 -0.0192009 unknown
polarizability: 154.6941149|3.4765052|128.8926059|-6.5037175|-1.73871|63.8870539 unknown
InChI: InChI=1S/C9H11N3/c1-3-8-10-11-9-7(2)5-4-6-12(8)9/h4-6H,3H2,1-2H3
charge 0 multiplicity 1
23 atoms
N  -0.336109 0.315143 0.165082
N  -1.187355 -1.761797 0.288069
N  0.210583 -1.899773 0.11694
C  -1.504793 -0.440693 0.317125
C  0.720924 -0.634963 0.042822
C  -2.883909 0.128796 0.456104
C  2.072791 -0.187787 -0.121155
C  -0.102262 1.687822 0.137946
C  2.288929 1.193318 -0.148862
C  1.201032 2.128737 -0.017144
C  -3.456171 0.696343 -0.873075
C  3.170181 -1.216943 -0.249943
H  -3.53043 -0.690099 0.814633
H  -2.896489 0.917096 1.235564
H  -0.963448 2.350034 0.244331
H  3.308379 1.573352 -0.271931
H  1.392918 3.204711 -0.038326
H  -2.834163 1.517783 -1.273534
H  -4.47624 1.088725 -0.713409
H  -3.505004 -0.096302 -1.639085
H  4.155479 -0.736007 -0.367708
H  2.985189 -1.876575 -1.116938
H  3.19347 -1.873822 0.638299
