program: Gaussian 09
title: 000249772
version: EM64L-G09RevD.01
frameworkgroup: C1[X(C8H9N3)]
method: RPBEPBE
basis: SDD
operation: Freq
keyword: #p
keyword: freq=noraman
keyword: PBEPBE/SDD
title: #p freq=noraman PBEPBE/SDD
converged: NO NO NO NO
title: Mulliken charges:
elementType: N N N C C C C C C C C H H H H H H H H H
charge: -0.256903 -0.132391 -0.116769 0.249855 -0.485293 0.178402 -0.196887 -0.672892 -0.304071 -0.224921 -0.183312 0.258674 0.211118 0.254826 0.213308 0.227130 0.243851 0.260361 0.232724 0.243193
chargesum: 0.00000
title: Mulliken charges with hydrogens summed into heavy atoms:
elementType: N N N C C C C C C C C
charge: -0.256903 -0.132391 -0.116769 0.249855 -0.015502 0.178402 0.057938 0.011396 -0.043710 0.007803 0.059880
polarizability: 1.40363367e+02 -8.62231438e+00 1.13448867e+02 6.53424286e+00 4.23802254e+00 5.49079650e+01
1716.lowfreq: -13.2792 -9.2518 -0.0004 0.0007 0.0009 10.9278 70.3496 101.9283 176.0698
frequency: 70.2067 101.9150 176.0659 207.9132 223.9601 269.0642 396.0347 430.1094 463.4817 532.0396 576.8100 588.0731 669.7539 694.5479 743.0858 749.3027 755.9868 786.6943 838.8482 890.4362 934.0326 954.5220 976.4969 983.8516 1003.5883 1038.9968 1065.0202 1079.1381 1129.8161 1159.8911 1223.3278 1253.6084 1294.3966 1313.2972 1317.3587 1369.5623 1389.7408 1427.6893 1459.0589 1465.2019 1475.8117 1489.6082 1501.6145 1520.3477 1628.1111 2983.7757 2987.6138 3065.5254 3086.3938 3098.4290 3157.7831 3172.1087 3189.5416 3196.6789
redmass: 2.5484 3.4397 1.4241 5.5247 2.6949 1.9696 4.3503 2.9536 4.3435 5.6065 4.1854 4.7096 7.0051 4.2024 2.9620 1.4118 4.5777 1.5158 1.4429 7.0122 1.3330 2.5576 1.3017 5.1469 2.6038 2.9769 1.7667 2.4197 1.4321 1.3853 1.7779 2.4786 1.6704 1.4100 1.8909 2.7624 1.2205 2.6683 2.3943 1.2678 1.0579 1.2519 3.9191 6.5616 6.4138 1.0648 1.0372 1.0958 1.0982 1.1011 1.0876 1.0895 1.0965 1.1010
irintensity: 1.0704 0.2478 0.6936 1.1873 1.4648 1.3197 3.0825 9.8984 1.6105 2.1325 1.3691 1.4165 3.1457 1.9213 8.1043 94.9880 0.8386 1.4896 2.7160 1.9884 0.2649 11.0721 0.4464 8.9405 7.1894 12.1621 5.0538 5.5714 6.4230 4.1462 3.1774 17.4308 12.7389 5.8763 3.4651 27.9921 9.4525 5.5536 7.4388 5.7149 13.9027 15.4377 8.2949 0.3704 6.0367 31.0723 25.8824 3.7193 47.3606 24.8113 4.7470 2.9646 5.8395 7.0644
temp: 298.150 k
press: 1.00000 atm
elementType: 7 7 7 6 6 6 6 6 6 6 6 1 1 1 1 1 1 1 1 1
symmnumber: 1
zpe: 416038.9 jmol-1
zpe.correction: 0.158461 hartree
zpe.thermalcorrener: 0.167522 hartree
zpe.thermalcorrenthalpy: 0.168466 hartree
zpe.thermalcorrgfe: 0.124041 hartree
zpe.sumelectzpe: -473.687450 hartree
zpe.sumelectthermal: -473.678388 hartree
zpe.sumelectthermalent: -473.677444 hartree
zpe.sumelectthermalfe: -473.721869 hartree
dipole: 0.9810 -6.0417 -0.3915
dipole: 6.1334
quadrupole: -53.5569 -72.8677 -66.7459
quadrupole: 3.2229 1.5376 0.9914
quadrupole: 10.8332 -8.4775 -2.3557 3.2229 1.5376 0.9914
hfenergy: -473.8459104 hartree
pointgroup: C01 [X(C8H9N3)]
dipole: -0.5421075 -2.3512352 -0.0255427 debye
dipolederiv: -0.1203851 0.2284998 -0.0462965 -0.2305628 -0.558414 -0.006707 -0.0125003 0.0603174 0.0547081 -0.1237261 -0.2431699 0.0246868 0.0311732 -0.0007899 -0.0145701 0.0164588 -0.0461558 -0.2481065 -0.4667452 0.1851588 -0.0035532 -0.2521397 -0.2397596 -0.0342612 -0.0250131 0.0256048 -0.2352635 0.3920527 -0.1338969 0.0401963 -0.1250497 0.0345829 0.0035668 0.0467735 -0.0357948 -0.0158875 0.1224457 0.0097233 -0.0170921 0.0554673 0.0621003 -0.0503247 0.0783103 -0.058846 0.1310094 -0.034225 -0.0187876 -0.012698 0.4199625 0.325114 0.0210694 -0.0429426 -0.010053 0.0948303 0.1463715 0.0342782 0.0273711 0.1466082 0.1568751 0.0122364 0.0249505 -0.0092295 -0.0876063 0.0004296 0.0223582 0.0187541 0.0582116 0.0443595 -0.0058752 -0.0595172 -0.0040876 -0.0036408 0.0708241 -0.0253151 0.0265133 -0.0664329 0.0568875 -0.0179871 0.0329767 -0.0100918 -0.1149491 -0.0699505 0.0486379 0.0078984 -0.0475671 0.0840391 -0.0208492 0.020516 -0.0056204 -0.1740643 0.0509479 -0.0871579 0.0406931 0.0075909 -0.0291238 -0.0084818 0.0270511 -0.0184641 -0.1476923 -0.0123884 -0.034503 -0.0453848 -0.0942948 0.027615 -0.0766793 -0.0275343 -0.0431393 0.0606402 0.0210313 -0.0266555 0.0801017 0.0620563 -0.0351639 0.1255824 0.0259082 0.0845387 -0.0540954 0.0315825 0.0808858 -0.0273878 0.0428956 0.0158672 0.0099243 -0.0296441 0.0180562 0.173647 -0.0269839 -0.1298693 -0.0736236 -0.1009836 0.0039162 -0.0737842 -0.0435497 -0.0433036 0.0324803 -0.1286442 0.138727 -0.0156957 0.1735266 0.0067273 0.0002835 -0.0109392 0.0122029 0.0694809 0.1032562 -0.0115255 0.0362433 -0.0657028 -0.0097894 0.1121653 0.0440386 0.0654738 -0.032182 0.0575464 0.036353 -0.0175924 0.0729946 0.0232462 0.0181645 -0.020103 0.0128313 0.1683238 0.0782545 -0.0567392 -0.0084233 -0.058349 -0.0613235 0.0063298 -0.0097706 0.0052639 0.1666197 -0.0916942 -0.0170022 -0.0347105 -0.0294044 0.0930335 0.0001975 -0.0354696 0.0004969 0.1617482 unknown
polarizability: 141.1649773|6.3021581|112.8000802|8.0066973|-0.3350999|54.7551415 unknown
InChI: InChI=1S/C8H9N3/c1-2-7-9-10-8-5-3-4-6-11(7)8/h3-6H,2H2,1H3
charge 0 multiplicity 1
20 atoms
N  0.008913 -0.195651 0.16108
N  1.296413 1.643652 0.261975
N  -0.028517 2.086127 0.044207
C  1.311721 0.285422 0.330999
C  2.527225 -0.569469 0.522636
C  -0.807534 0.966232 -0.015724
C  -0.527621 -1.480594 0.159808
C  3.006404 -1.265368 -0.781742
C  -2.209095 0.800565 -0.207086
C  -1.892156 -1.63472 -0.023537
C  -2.744459 -0.487057 -0.211794
H  3.324712 0.093775 0.898479
H  2.341752 -1.330013 1.307647
H  0.162319 -2.313594 0.309517
H  2.234676 -1.936416 -1.201493
H  3.910038 -1.868642 -0.583017
H  3.253897 -0.51209 -1.549064
H  -2.824222 1.693149 -0.342893
H  -2.312374 -2.643845 -0.022716
H  -3.818791 -0.633462 -0.357183
