program: Gaussian 09
title: 000249764
version: EM64L-G09RevD.01
frameworkgroup: C1[X(C8H11NO4S)]
method: RPBEPBE
basis: SDD
operation: Freq
keyword: #p
keyword: freq=noraman
keyword: PBEPBE/SDD
title: #p freq=noraman PBEPBE/SDD
converged: NO YES NO NO
title: Mulliken charges:
elementType: S O O O O N C C C C C C C C H H H H H H H H H H H
charge: 0.926188 -0.705436 -0.587009 -0.686018 -0.249050 -0.506031 -0.227431 0.468106 -0.359776 -0.334754 -0.344934 -0.354514 0.337779 -0.536735 0.254748 0.236783 0.284026 0.398842 0.398451 0.262837 0.256875 0.347014 0.232350 0.233116 0.254572
chargesum: 0.00000
title: Mulliken charges with hydrogens summed into heavy atoms:
elementType: S O O O O N C C C C C C C C
charge: 0.926188 -0.358422 -0.587009 -0.686018 -0.249050 0.291263 0.027317 0.468106 -0.122993 -0.050727 -0.082097 -0.097640 0.337779 0.183303
polarizability: 2.47607073e+02 -1.45792916e+01 1.44376859e+02 -8.62353881e+00 8.57355523e-01 7.05332403e+01
1716.lowfreq: -2.2485 -1.2326 0.0024 0.0028 0.0029 6.7115 23.1166 35.3757 50.7327
frequency: 22.9743 35.3484 50.6865 61.5979 93.6414 131.6530 143.6719 161.6583 187.5358 202.4146 234.9965 247.6497 278.1098 316.8802 346.7906 374.0643 383.0393 404.4747 418.1906 430.8680 501.1008 514.5653 604.5504 628.2020 724.3429 729.0751 755.4042 794.9772 822.0529 829.8533 836.7840 897.6545 898.9262 967.6241 975.6228 976.3217 997.0927 1015.6983 1111.6442 1112.4943 1127.7629 1156.8205 1190.6459 1238.9892 1261.9242 1269.1363 1318.2985 1341.8861 1387.3628 1437.8042 1444.3406 1469.4464 1469.9170 1506.7191 1562.4790 1611.6374 1620.5635 1716.0644 2515.7744 2579.3659 2976.7826 3072.4304 3092.5483 3127.7121 3132.6391 3139.7582 3171.7909 3176.4623 3561.4976
redmass: 8.2595 5.9031 5.7198 5.7623 4.0739 4.2718 5.1496 5.5303 4.6090 1.5455 1.8414 4.1450 4.7491 5.9816 2.6219 2.7231 12.9882 5.8275 2.9500 3.2187 4.0724 2.4035 5.1126 6.7186 3.1076 3.0348 9.2396 1.7434 1.2995 1.9500 1.9989 2.1676 3.2827 1.3923 2.0758 2.7255 2.6426 1.3091 1.2565 1.1057 1.2928 1.3192 1.3582 1.8870 2.7002 1.1649 1.4182 1.5860 3.0169 1.2267 3.4092 1.0791 1.0585 2.4352 5.3876 2.2743 5.7448 1.7810 1.1429 1.0615 1.0323 1.1048 1.0915 1.0924 1.0903 1.1008 1.0936 1.0956 1.0668
irintensity: 4.3962 0.9372 3.6081 4.2877 3.9705 7.4819 9.4404 5.5487 26.1954 0.9053 0.5928 5.0732 87.9151 22.1763 5.7923 70.7153 21.0947 177.8823 4.7514 62.7293 67.2235 26.9457 3.8848 6.3163 31.3151 0.9058 152.1340 80.0749 4.2681 41.5341 20.9369 108.1453 36.6289 2.6008 22.9717 32.7215 7.1292 104.3901 0.5913 23.9838 7.0586 6.0935 263.7433 13.0367 277.8664 188.2915 27.6893 112.1440 31.0650 4.5772 11.0265 47.4883 27.3220 52.2587 71.3338 148.0324 468.2752 1129.6115 152.9724 2977.2627 52.4506 35.3911 12.6596 3.6596 9.0778 18.9305 6.8737 4.6929 15.7353
temp: 298.150 k
press: 1.00000 atm
elementType: 16 8 8 8 8 7 6 6 6 6 6 6 6 6 1 1 1 1 1 1 1 1 1 1 1
symmnumber: 1
zpe: 477900.9 jmol-1
zpe.correction: 0.182023 hartree
zpe.thermalcorrener: 0.197692 hartree
zpe.thermalcorrenthalpy: 0.198636 hartree
zpe.thermalcorrgfe: 0.136940 hartree
zpe.sumelectzpe: -1063.985822 hartree
zpe.sumelectthermal: -1063.970153 hartree
zpe.sumelectthermalent: -1063.969209 hartree
zpe.sumelectthermalfe: -1064.030905 hartree
dipole: 7.9584 2.3776 -0.6189
dipole: 8.3290
quadrupole: -92.3567 -76.3563 -97.0869
quadrupole: -18.1134 3.7957 6.3144
quadrupole: -3.7567 12.2436 -8.4870 -18.1134 3.7957 6.3144
hfenergy: -1064.167845 hartree
pointgroup: C01 [X(C8H11N1O4S1)]
dipole: 3.0028641 1.2884084 -0.2464261 debye
dipolederiv: 1.4542985 -0.0006122 -0.1827684 0.0364375 1.1152009 -0.1327446 -0.4266111 -0.2904645 0.8689942 -1.0610615 -0.0832742 -0.1821844 -0.0468085 -1.0688447 0.177738 -0.3080321 -0.0567926 -0.4797685 -0.6290384 -0.1372453 -0.015281 -0.0835139 -0.4662783 -0.0228847 0.495025 0.3711278 -0.6325342 -1.4776288 -0.0860364 0.2599635 -0.6275669 -0.6694805 0.0100392 -0.0835619 -0.0677774 -0.5747776 -1.8304383 0.6524443 -0.1065736 0.6536687 -0.6137988 0.0472916 -0.1375182 0.061044 -0.3011038 -1.9104582 -0.2153304 -0.0456186 -0.9784321 -0.426484 -0.0130374 -0.0940306 0.0428066 -0.3684008 2.0014904 -0.1526214 0.1358677 0.0074169 0.4080996 0.0167854 0.1729411 -0.0074732 0.0856907 -1.1189807 0.1704432 -0.0721277 0.4435429 -0.2893294 0.0316024 -0.1169172 -0.0062347 -0.0255144 0.6040595 -0.1279371 0.0577165 0.152279 0.13232 0.0099517 0.0820217 -0.0087648 -0.1269588 0.3970279 -0.0964238 0.0316199 -0.3485086 0.1443659 -0.0266664 0.0317284 -0.0049185 -0.079855 -0.3942879 0.2077877 -0.0092875 0.6197251 -0.2171361 0.04891 -0.010098 0.0205356 -0.1675368 -0.8055735 0.1050632 -0.0376982 -0.3237021 0.0510331 -0.0173783 -0.0683023 0.0089408 -0.1894163 1.7926449 -0.5745972 0.1244776 -0.3049216 0.3050326 -0.0243982 0.1513176 -0.0531174 0.1447408 0.4700846 -0.1697959 0.0082752 -0.6440005 0.6200137 -0.044265 0.0100178 -0.0131285 0.3092951 0.0343366 -0.0241957 -0.0020528 -0.0086486 -0.0999304 -0.0002767 -0.0090997 -0.009194 0.1397132 0.0812995 0.0772393 -0.0071382 0.0259995 -0.0722621 -0.0003112 -0.00829 0.0028948 0.1527265 0.1115377 -0.0361168 -0.0208081 -0.0269608 0.0612949 -0.0024055 0.002125 -0.0011932 0.15066 1.443093 0.4941489 -0.045497 0.0518226 0.2524708 -0.0409043 0.041415 -0.0230941 0.2923996 0.5380291 0.1642629 -0.033034 1.2298999 0.6465847 -0.0392851 0.0927714 0.022053 0.2928446 0.0026913 -0.0749154 -0.0156213 -0.0673656 0.0497612 -0.0079977 -0.017833 -0.0088208 0.1718681 0.0706363 0.0439682 -0.0080933 0.0650894 -0.0465957 0.002009 -0.0055812 0.0028639 0.1645079 0.1975048 -0.0609561 0.1635966 -0.0652795 0.1982368 0.011317 0.2011608 0.0274237 0.1813367 0.0973742 -0.0516911 -0.0827415 0.1221095 -0.0480543 -0.0510296 -0.0167823 -0.0963591 -0.0828972 0.0714984 -0.0712087 0.109535 0.1097183 -0.0493347 0.0680665 0.0490281 0.0833712 -0.0527874 -0.1401394 0.0475998 -0.0245264 0.0079997 0.0831146 -0.0001261 -0.0268941 0.0042714 0.1267733 unknown
polarizability: 250.0047758|-1.9089818|141.6660598|-1.157935|-7.1887586|70.8463364 unknown
InChI: InChI=1S/C8H10NO.O2S.HO/c1-10-8-4-2-7(6-9)3-5-8;1-3-2;/h2-6H,9H2,1H3;;1H
charge 0 multiplicity 1
25 atoms
S  -4.432102 -1.592446 -0.138749
O  -4.666512 0.522564 -0.296504
O  -4.843183 -1.826644 1.41732
O  -2.768887 -1.640953 -0.336389
O  4.286426 -0.059467 0.448691
N  -2.169572 0.840956 -0.191031
C  -1.11972 1.60725 -0.042114
C  0.250628 1.121429 0.076045
C  1.312836 2.067681 0.193686
C  0.564746 -0.270346 0.084919
C  2.642458 1.647205 0.313011
C  1.894073 -0.702874 0.207169
C  2.939805 0.257005 0.321385
C  4.671778 -1.479441 0.477153
H  -1.277327 2.695609 -0.001888
H  1.084331 3.140245 0.189801
H  -0.23198 -1.019895 0.003735
H  -3.230826 1.092712 -0.224763
H  -2.152118 -0.247214 -0.23448
H  3.466956 2.359728 0.403261
H  2.109851 -1.774728 0.215705
H  -5.389511 0.716193 0.357723
H  4.392116 -1.985255 -0.46562
H  4.209869 -1.998226 1.337672
H  5.765063 -1.472389 0.587665
