program: Gaussian 09
title: 000249754
version: EM64L-G09RevD.01
frameworkgroup: C1[X(C15H14N2O5S)]
method: RPBEPBE
basis: SDD
operation: Freq
keyword: #p
keyword: freq=noraman
keyword: PBEPBE/SDD
title: #p freq=noraman PBEPBE/SDD
converged: YES YES NO NO
title: Mulliken charges:
elementType: S O O O O O N N C C C C C C C C C C C C C C C H H H H H H H H H H H H H H
charge: 0.955892 -0.525140 -0.512855 -0.436687 -0.244154 -0.253655 -0.548242 -0.454775 -0.116813 0.392229 -0.204651 -0.237929 0.501920 -0.322080 -0.422298 -0.507812 -0.320828 0.288267 -0.200434 -0.342307 0.232275 0.116037 -0.777674 0.292357 0.282356 0.288603 0.321913 0.234437 0.269367 0.294306 0.239395 0.278233 0.309670 0.215844 0.265071 0.263989 0.386172
chargesum: 0.00000
title: Mulliken charges with hydrogens summed into heavy atoms:
elementType: S O O O O O N N C C C C C C C C C C C C C C C
charge: 0.955892 -0.525140 -0.512855 -0.050515 -0.244154 -0.253655 -0.255885 -0.145106 -0.116813 0.392229 0.077705 0.050674 0.501920 -0.000167 -0.187861 -0.238445 -0.026522 0.288267 0.038962 -0.064074 0.232275 0.116037 -0.032770
polarizability: 2.57257819e+02 -1.42084894e+01 2.63704273e+02 2.86234637e+01 1.75507841e+01 1.95551509e+02
1716.lowfreq: -4.8033 -2.0462 0.0014 0.0015 0.0018 6.1804 11.1822 14.1513 20.6150
frequency: 11.0446 14.0683 20.4288 36.2052 48.8431 60.8683 77.5298 83.2744 99.2816 103.8797 150.6667 159.9164 172.5488 177.3413 196.3759 209.2695 229.4093 277.1267 314.9309 321.3496 351.1610 357.7851 378.8405 402.0672 410.5811 413.9496 427.0171 455.2877 500.1886 517.7949 524.1739 545.5345 566.3347 594.1157 597.3058 613.8501 618.1420 654.4443 672.0693 687.4678 715.7701 724.3452 730.5027 780.6187 813.8654 823.8537 832.2314 834.3330 868.6014 891.6949 926.9234 929.9467 940.4472 961.0880 963.6071 984.4167 984.8559 994.6728 1000.1899 1000.9800 1040.5998 1042.6034 1050.9370 1089.6616 1121.9973 1135.3982 1183.0395 1183.8152 1214.5374 1228.1827 1240.4324 1263.9146 1296.4376 1312.7345 1326.0418 1368.7195 1391.1665 1397.2068 1407.8459 1437.0948 1447.9842 1468.2098 1472.9680 1474.6457 1498.9238 1581.7202 1591.7318 1598.4641 1600.3039 1632.1610 1641.9042 2997.6307 3097.6865 3102.4486 3124.6848 3138.3095 3149.0079 3160.7127 3162.8445 3177.6418 3186.1655 3196.5688 3397.2851 3531.1603 3533.6148
redmass: 3.9367 1.5657 3.5026 4.6890 4.8635 7.4890 5.3683 6.2524 6.5300 5.7232 7.4833 5.7829 5.2727 6.6829 9.6915 7.3547 6.1161 5.6044 8.1732 6.6176 5.3288 5.8527 5.4973 5.1498 4.5765 3.0105 3.2065 8.4166 4.3199 3.3463 2.9805 4.6122 4.1046 4.4439 3.1212 1.5575 6.8340 1.1946 6.1461 2.2699 5.3258 3.3321 3.7731 1.8265 4.2231 4.0049 1.9013 1.4220 1.4228 5.0164 1.5839 5.7263 1.4855 2.0736 2.6997 4.7972 6.0252 1.6648 1.3662 1.3323 1.6437 2.7432 2.3940 1.6779 1.3140 1.5176 1.1157 1.1211 3.3944 1.5084 2.1348 1.8749 1.4065 1.3425 2.6842 4.0658 1.2202 7.3919 4.8039 3.0199 1.0464 1.1929 1.9582 2.4746 2.3189 6.1887 6.8804 5.6305 6.1650 4.9543 8.7140 1.0365 1.0996 1.0989 1.0901 1.0920 1.0887 1.0947 1.0918 1.0931 1.0980 1.0954 1.0758 1.0642 1.0767
irintensity: 0.2732 0.3528 0.7968 8.9565 0.1463 0.7844 3.0430 5.7580 1.6633 0.3710 0.4336 3.1993 3.7254 5.9935 1.8303 5.0379 4.8624 6.4386 3.0200 2.5203 33.0436 11.2816 1.0182 8.3158 40.3980 0.1203 0.9584 94.4226 5.9820 21.7263 70.9424 73.7148 21.7250 45.6029 0.8345 117.1281 6.0833 54.1958 0.9106 3.8469 19.6409 4.0019 72.0253 37.4818 128.9535 19.3195 64.4971 39.4488 37.6899 72.7061 11.3037 5.7802 10.2789 21.8242 26.9763 3.4227 7.0834 15.0064 0.8359 4.4423 16.4343 226.8990 40.6632 9.8973 10.9075 101.2719 17.4207 18.1728 73.2080 0.8385 17.4642 56.1353 54.1638 10.7811 109.3808 245.9374 48.3425 6.6628 14.1358 57.2624 16.2079 15.2649 24.2715 8.7554 437.2962 27.7245 85.1528 44.3038 13.4829 102.1697 219.9313 9.9199 12.7323 8.9018 13.7623 3.2278 11.7446 3.6111 5.4155 0.2769 2.8864 10.3092 18.6258 49.8920 16.9985
temp: 298.150 k
press: 1.00000 atm
elementType: 16 8 8 8 8 8 7 7 6 6 6 6 6 6 6 6 6 6 6 6 6 6 6 1 1 1 1 1 1 1 1 1 1 1 1 1 1
symmnumber: 1
zpe: 702522.3 jmol-1
zpe.correction: 0.267577 hartree
zpe.thermalcorrener: 0.290099 hartree
zpe.thermalcorrenthalpy: 0.291043 hartree
zpe.thermalcorrgfe: 0.211291 hartree
zpe.sumelectzpe: -1461.884275 hartree
zpe.sumelectthermal: -1461.861752 hartree
zpe.sumelectthermalent: -1461.860808 hartree
zpe.sumelectthermalfe: -1461.940560 hartree
dipole: -5.0596 4.8921 -2.6231
dipole: 7.5109
quadrupole: -112.2583 -159.9160 -141.9876
quadrupole: 8.8859 20.4365 2.8956
quadrupole: 25.7957 -21.8620 -3.9336 8.8859 20.4365 2.8956
hfenergy: -1462.1518512 hartree
pointgroup: C01 [X(C15H14N2O5S1)]
dipole: 1.9613024 1.9297675 1.077637 debye
polarizability: 254.9267511|15.6823453|262.6853985|30.7210556|-18.5453051|198.9014522 unknown
InChI: InChI=1S/C15H14N2O5S/c1-10(18)16-12-5-7-14(8-6-12)23(21,22)17-13-4-2-3-11(9-13)15(19)20/h2-9,16-17,19H,1H3
charge 0 multiplicity 1
37 atoms
S  -0.917259 -2.932897 0.068659
O  -0.826334 -4.107553 1.185963
O  -1.203176 -3.204164 -1.504075
O  -2.948572 4.230095 -0.050519
O  4.241994 1.625874 -1.439994
O  -2.241095 3.218458 1.915872
N  -2.41183 -1.849879 0.683132
N  4.147745 0.409367 0.566825
C  0.646559 -1.890373 0.194432
C  -2.62632 -0.620514 0.004596
C  0.989234 -1.048634 -0.876841
C  1.418669 -1.998735 1.364997
C  2.95887 -0.345252 0.395096
C  2.156016 -0.264082 -0.778235
C  2.584918 -1.219589 1.456504
C  -2.468383 0.628294 0.658448
C  -3.059075 -0.653347 -1.354071
C  -2.777044 1.830147 -0.02302
C  -3.325413 0.552098 -2.03427
C  -3.198294 1.79661 -1.377194
C  4.734224 1.331967 -0.313699
C  -2.621257 3.107175 0.72453
C  6.0304 1.957552 0.192335
H  -2.256725 -1.766647 1.703829
H  0.370691 -1.020383 -1.779408
H  1.129543 -2.693495 2.159979
H  2.457417 0.403007 -1.587145
H  3.211061 -1.293069 2.354108
H  -2.122147 0.686683 1.697604
H  -3.187006 -1.622904 -1.843629
H  -3.654966 0.519042 -3.077829
H  -3.422895 2.734474 -1.891601
H  4.640229 0.258196 1.449948
H  6.309121 1.655849 1.21684
H  5.932287 3.055921 0.159748
H  6.851434 1.685014 -0.49316
H  -2.824521 5.04759 0.50224
