program: Gaussian 09
title: 000249750
version: EM64L-G09RevD.01
frameworkgroup: C1[X(C28H18)]
method: RPBEPBE
basis: SDD
operation: Freq
keyword: #p
keyword: freq=noraman
keyword: PBEPBE/SDD
title: #p freq=noraman PBEPBE/SDD
converged: NO YES NO NO
title: Mulliken charges:
elementType: C C C C C C C C C C C C C C C C C C C C C C C C C C C C H H H H H H H H H H H H H H H H H H
charge: 0.110933 0.063457 0.224871 0.326273 0.534049 0.174928 -0.835197 0.125898 0.422970 0.139019 0.439709 -0.387967 -0.525503 -0.529998 -0.515116 -0.326967 -0.344143 -0.460243 -0.446046 -0.355812 -0.355866 -0.289986 -0.263401 -0.260183 -0.251815 -0.228862 -0.228876 -0.247083 0.232463 0.263339 0.246450 0.232622 0.237898 0.262978 0.222333 0.239436 0.242056 0.255232 0.255246 0.228903 0.227275 0.229419 0.229003 0.229131 0.229136 0.228038
chargesum: 0.00000
title: Mulliken charges with hydrogens summed into heavy atoms:
elementType: C C C C C C C C C C C C C C C C C C C C C C C C C C C C
charge: 0.110933 0.063457 0.224871 0.326273 0.534049 0.174928 -0.602733 0.125898 0.422970 0.139019 0.439709 -0.124628 -0.279054 -0.297376 -0.277218 -0.063989 -0.121810 -0.220807 -0.203990 -0.100580 -0.100620 -0.061083 -0.036126 -0.030764 -0.022812 0.000268 0.000260 -0.019045
polarizability: 5.44672090e+02 -7.97938267e+00 3.47932679e+02 1.01341921e-02 -1.03927191e-02 1.48960168e+02
1716.lowfreq: -15.3219 -4.3240 -0.0005 0.0007 0.0010 6.4754 12.0614 43.9588 48.0805
frequency: -14.7256 43.9256 48.0774 60.7975 75.3644 109.3531 126.0064 135.8809 175.7072 214.5788 216.4584 236.7855 253.6983 257.3782 307.6944 324.0981 346.1964 400.4500 407.4502 417.2769 428.7748 449.8445 475.2973 490.5546 498.3765 520.0662 534.4389 534.9491 549.7520 571.1733 589.4674 607.9669 616.9102 638.5942 643.0970 657.2110 681.6537 704.9574 735.3654 744.8209 749.5067 756.8784 758.1240 763.9662 791.9729 803.8510 816.2237 824.6017 832.7572 855.7888 861.1110 874.7331 886.7346 890.6371 892.2045 925.3320 931.5306 933.7272 956.8025 961.5802 981.5622 985.1174 986.4480 987.1100 993.5720 994.1800 996.5825 1021.9825 1029.7153 1041.4349 1062.3948 1076.3812 1094.5132 1105.9711 1154.9413 1163.9336 1171.6580 1177.5242 1179.0856 1186.5804 1187.2292 1224.2952 1230.4938 1238.4084 1249.4139 1266.7420 1276.7846 1295.3397 1308.5263 1329.1637 1352.7558 1361.4351 1367.0434 1390.9605 1404.0399 1411.4682 1413.0709 1427.6788 1428.6302 1447.6378 1456.2403 1469.2201 1485.5409 1498.2879 1508.4945 1547.4211 1566.4238 1578.6236 1594.2824 1607.3189 1612.8117 1619.3647 1624.1603 1635.7504 3116.6931 3119.4580 3120.0219 3122.3861 3123.6435 3128.4413 3129.7968 3133.7736 3138.6173 3140.2042 3143.2547 3148.7765 3148.8883 3157.0674 3163.1768 3163.4360 3170.2962 3237.2960
redmass: 4.2190 4.9255 4.6236 5.1822 3.8652 4.2550 5.4849 4.7261 3.9989 4.3534 6.1147 5.9782 4.1419 4.3210 4.6381 5.7326 3.8682 2.8343 3.1409 5.0754 2.9607 5.6411 5.4071 5.6789 3.8212 6.5015 3.1641 5.9689 3.4852 2.9830 4.5758 5.5970 7.2428 4.1495 6.4514 6.4355 3.5134 1.8341 3.0408 2.1337 4.9863 5.5982 1.2665 1.4986 2.9701 2.3087 1.7394 5.6611 1.6313 1.8178 1.2752 4.3731 1.7871 1.7956 4.4409 2.6541 2.3000 2.1382 1.3872 1.4431 1.3862 1.3532 1.4037 6.2675 1.3716 1.3773 1.3134 3.1254 2.9613 2.2210 2.3623 1.6097 2.7813 2.3665 1.5536 1.3697 1.0532 1.1952 1.0948 1.1201 1.4740 1.7965 1.9951 1.9920 1.8220 1.8588 1.6988 2.1296 1.4083 3.5495 3.4967 5.8409 4.6555 5.5999 3.9043 2.2297 2.6115 2.5494 2.2304 3.2559 2.7551 2.6245 2.7270 3.6472 3.6509 5.8450 7.5496 5.9461 5.8418 6.1553 6.1669 6.4074 6.5198 6.8622 1.0859 1.0865 1.0866 1.0846 1.0887 1.0878 1.0886 1.0909 1.0921 1.0926 1.0984 1.0922 1.0968 1.0994 1.1001 1.1016 1.0942 1.0902
irintensity: 0.0363 0.4066 0.1969 0.2217 0.0835 0.0066 0.2618 0.0880 0.3741 5.2202 0.0709 0.2584 0.2256 0.1462 0.3506 0.0615 0.7777 0.1895 4.7238 4.6529 1.6178 0.0829 0.4070 4.8631 3.0373 1.1582 14.5220 3.6366 0.6782 0.7154 4.9273 0.6665 2.9403 0.2502 5.4437 7.7546 9.3075 35.5084 31.5272 7.0400 1.5564 0.6733 70.6990 14.9730 12.8154 1.0488 13.0303 1.6137 50.3389 25.5215 1.2098 3.5854 21.4823 1.3446 5.4546 0.4137 4.0317 26.6143 3.0164 6.2244 0.1053 0.1524 1.9679 1.7180 1.1975 0.1246 0.0784 5.8198 16.9048 1.3454 2.2782 8.9776 2.5469 1.3342 1.8021 2.1570 0.0117 9.7882 2.2473 0.1950 2.1440 0.2172 3.7172 3.0403 2.6036 7.2116 3.3677 2.4270 0.6513 19.0817 0.3321 0.0249 1.3215 1.1090 1.5466 1.3446 7.3875 5.9310 8.2967 6.8121 13.6216 5.6048 9.7816 2.4342 18.4105 0.4236 1.0754 1.3427 3.5175 6.9779 1.1854 0.6437 0.0421 0.3253 0.7645 2.9321 1.5269 1.0035 9.8053 0.7863 7.7276 13.4271 9.5988 17.5613 25.7758 37.6445 29.7027 52.1893 61.8903 12.4719 14.7984 6.2248
temp: 298.150 k
press: 1.00000 atm
elementType: 6 6 6 6 6 6 6 6 6 6 6 6 6 6 6 6 6 6 6 6 6 6 6 6 6 6 6 6 1 1 1 1 1 1 1 1 1 1 1 1 1 1 1 1 1 1
symmnumber: 1
zpe: 952882.3 jmol-1
zpe.correction: 0.362934 hartree
zpe.thermalcorrener: 0.382029 hartree
zpe.thermalcorrenthalpy: 0.382973 hartree
zpe.thermalcorrgfe: 0.316095 hartree
zpe.sumelectzpe: -1075.993042 hartree
zpe.sumelectthermal: -1075.973947 hartree
zpe.sumelectthermalent: -1075.973003 hartree
zpe.sumelectthermalfe: -1076.039881 hartree
dipole: 0.1129 0.5396 0.0002
dipole: 0.5513
quadrupole: -142.6013 -137.7055 -165.5979
quadrupole: 3.9381 0.0027 -0.0033
quadrupole: 6.0336 10.9294 -16.9630 3.9381 0.0027 -0.0033
hfenergy: -1076.355976 hartree
pointgroup: C01 [X(C28H18)]
dipole: -0.0419581 0.2127941 -0.0000882 debye
polarizability: 544.829812|5.7109991|347.774957|0.0102532|0.0102753|148.9601681 unknown
InChI: InChI=1S/C28H18/c1-2-10-21(11-3-1)27-25-17-16-19-8-4-6-12-23(19)26(25)18-22-15-14-20-9-5-7-13-24(20)28(22)27/h1-18H
charge 0 multiplicity 1
46 atoms
C  -1.036468 -0.811889 0.000087
C  -0.343206 0.445387 0.000035
C  1.09573 0.502257 0.000035
C  1.891477 -0.70747 0.000077
C  -0.208678 -2.013164 -0.000042
C  -2.511701 -1.001977 0.000233
C  1.201967 -1.934649 -0.000014
C  3.359098 -0.629064 0.000141
C  -3.048806 -2.34786 -0.000055
C  -1.034485 1.784325 -0.000175
C  3.991386 0.663627 0.00009
C  1.790029 1.778981 -0.000054
C  -0.80661 -3.332106 -0.000257
C  3.167561 1.853286 -0.000029
C  -2.169793 -3.496771 -0.000332
C  -3.47307 0.059781 0.000731
C  4.197114 -1.785427 0.000259
C  -4.458968 -2.571926 0.000013
C  5.416153 0.761091 0.000149
C  -1.327518 2.445726 -1.221706
C  -1.326752 2.446567 1.221086
C  -4.85683 -0.180462 0.000822
C  5.595624 -1.672692 0.000317
C  -5.365479 -1.505721 0.000424
C  6.214608 -0.389937 0.00026
C  -1.931227 3.72383 -1.223381
C  -1.93046 3.724672 1.222258
C  -2.239504 4.3663 -0.000686
H  1.755075 -2.879431 -0.000093
H  1.199609 2.698426 -0.000143
H  -0.134436 -4.198164 -0.000391
H  3.667548 2.829432 -0.000098
H  -2.619957 -4.496287 -0.000539
H  -3.145519 1.095688 0.001098
H  3.752391 -2.785596 0.000319
H  -4.820845 -3.607343 -0.000234
H  5.877051 1.756206 0.000107
H  -1.089233 1.948764 -2.168825
H  -1.087867 1.950264 2.1684
H  -5.54643 0.671085 0.001216
H  6.215616 -2.57611 0.000412
H  -6.44577 -1.687635 0.000479
H  7.307144 -0.308778 0.000307
H  -2.157707 4.217101 -2.175526
H  -2.156344 4.2186 2.174205
H  -2.706819 5.357566 -0.000881
