program: Gaussian 09
title: 000249741
version: EM64L-G09RevD.01
frameworkgroup: C1[X(C13H17Cl2NO)]
method: RPBEPBE
basis: SDD
operation: Freq
keyword: #p
keyword: freq=noraman
keyword: PBEPBE/SDD
title: #p freq=noraman PBEPBE/SDD
converged: YES YES NO NO
title: Mulliken charges:
elementType: Cl Cl O N C C C C C C C C C C C C C H H H H H H H H H H H H H H H H H
charge: -0.058085 -0.046083 -0.260311 -0.144028 0.176995 -0.317842 -0.345557 0.105036 0.307269 -0.328482 -0.582550 0.463601 -0.588092 -0.574726 -0.422467 -0.824087 -0.807869 0.225123 0.275738 0.244005 0.273823 0.227888 0.239146 0.256736 0.312624 0.267546 0.276044 0.238204 0.224314 0.272817 0.218987 0.228941 0.238360 0.226982
chargesum: 0.00000
title: Mulliken charges with hydrogens summed into heavy atoms:
elementType: Cl Cl O N C C C C C C C C C C C C C
charge: -0.058085 -0.046083 -0.260311 -0.144028 0.176995 0.183018 0.172271 0.105036 0.307269 -0.100593 -0.343404 0.463601 -0.018731 -0.031136 -0.184263 -0.107969 -0.113586
polarizability: 2.27894237e+02 -9.53990074e+00 1.66197685e+02 -6.80122601e+00 -9.40814073e+00 1.20701127e+02
1716.lowfreq: -32.1451 -0.0026 -0.0024 -0.0016 3.0885 7.8573 8.7480 28.1829 30.7040
frequency: -32.1395 28.0804 30.6215 39.3031 41.1279 77.3218 82.9210 102.0346 119.5271 131.1005 164.4202 183.3704 204.5389 213.3333 232.8695 246.0251 270.3403 299.8590 334.9929 379.9260 408.6434 432.3995 444.4603 499.7217 534.7388 579.9630 584.9255 660.9947 692.9595 710.8255 717.2916 734.9361 756.6259 776.5436 779.5195 831.6374 893.2666 898.1735 935.8172 958.0104 984.6763 998.3451 1013.7563 1022.8569 1044.6572 1046.3911 1049.2234 1050.5225 1086.4247 1121.1467 1144.3308 1168.2988 1212.4818 1231.1353 1246.8273 1258.6347 1260.6051 1282.6079 1289.7960 1303.3352 1356.9719 1363.8672 1365.1528 1391.3831 1397.3649 1400.7099 1404.8334 1445.2366 1455.0619 1460.7576 1463.7344 1468.3452 1472.7954 1473.5258 1476.0789 1497.2582 1555.6491 1578.8383 1620.2346 2976.8710 2981.7362 3005.4153 3031.6010 3058.7031 3061.5889 3063.8629 3065.3307 3087.8328 3093.8392 3094.5359 3101.0323 3116.0723 3119.9533 3143.6674 3151.9806 3157.1752
redmass: 1.0131 5.7339 6.3754 6.3747 7.9314 3.8532 4.0328 3.2365 2.5304 1.0987 4.3627 4.8601 2.7868 4.0784 4.7183 6.1271 3.0816 3.8476 3.6850 3.2438 4.1612 3.0515 3.9101 3.7023 5.1187 4.7762 3.5861 6.3096 5.6971 4.9726 5.0834 4.6183 3.4452 1.1692 1.2820 1.4146 1.3680 3.0708 3.4063 1.3670 1.4792 1.4867 1.6993 1.5101 2.5441 1.9969 4.4273 1.6122 1.9355 1.4719 1.5327 1.6668 2.0621 2.1130 2.3801 1.1619 1.1836 1.4764 1.6509 1.2477 1.2603 3.1449 1.6188 2.0666 1.2384 1.6826 1.7454 1.1055 1.0948 1.1304 1.0611 1.1341 1.1397 1.0599 1.2619 2.0610 7.4673 6.5542 6.2831 1.0388 1.0383 1.0659 1.0603 1.0948 1.0586 1.0948 1.0577 1.0999 1.1001 1.0964 1.1038 1.0913 1.0868 1.0973 1.1106 1.1106
irintensity: 0.5013 0.8121 0.3573 0.1212 0.6043 2.8174 3.5388 4.4913 1.4774 1.3996 1.2041 0.4096 2.7941 3.4416 4.7089 1.7898 3.5261 1.3529 13.6469 10.2622 2.0489 9.6632 10.1468 7.8305 0.2663 6.3069 22.8931 27.4046 41.0812 22.9915 16.2095 20.1971 6.0957 25.0516 0.4992 41.5920 1.4509 8.1071 4.1122 1.2600 0.8845 8.7953 42.8819 2.9037 0.4576 7.5216 1.7246 18.7490 38.2991 26.7036 28.6703 14.6083 16.2504 15.9295 9.8081 11.8960 20.8325 94.1451 13.5148 14.4939 2.6848 0.4276 4.9164 135.1145 21.9532 17.5599 10.8297 22.2018 2.8003 30.4737 26.9101 3.3334 30.5567 7.2999 55.1896 6.9947 160.7358 36.4366 42.3204 32.0271 21.1167 16.3517 14.9950 20.5587 13.4214 17.5780 20.3745 15.7814 16.0660 3.9681 2.5635 24.3616 14.3343 17.0470 14.7487 5.7183
temp: 298.150 k
press: 1.00000 atm
elementType: 17 17 8 7 6 6 6 6 6 6 6 6 6 6 6 6 6 1 1 1 1 1 1 1 1 1 1 1 1 1 1 1 1 1
symmnumber: 1
zpe: 716492.6 jmol-1
zpe.correction: 0.272898 hartree
zpe.thermalcorrener: 0.291023 hartree
zpe.thermalcorrenthalpy: 0.291967 hartree
zpe.thermalcorrgfe: 0.223763 hartree
zpe.sumelectzpe: -1554.410718 hartree
zpe.sumelectthermal: -1554.392593 hartree
zpe.sumelectthermalent: -1554.391649 hartree
zpe.sumelectthermalfe: -1554.459853 hartree
dipole: -3.3451 1.4241 1.0470
dipole: 3.7834
quadrupole: -116.2741 -129.6541 -114.1200
quadrupole: 5.8282 -0.9187 -11.8482
quadrupole: 3.7420 -9.6381 5.8961 5.8282 -0.9187 -11.8482
hfenergy: -1554.6836158 hartree
pointgroup: C01 [X(C13H17Cl2N1O1)]
dipole: -1.325581 -0.5427214 -0.4048179 debye
polarizability: 228.1785156|8.2530968|164.5768651|7.7677037|-11.7622511|122.0376682 unknown
InChI: InChI=1S/C13H17Cl2NO/c1-10-3-4-12(11(2)9-10)13(17)16(7-5-14)8-6-15/h3-4,9H,5-8H2,1-2H3
charge 0 multiplicity 1
34 atoms
Cl 5.572585 0.836028 -0.163808
Cl 0.941488 -4.337506 -0.530421
O  1.163384 1.889298 0.831909
N  1.605128 -0.312994 0.248065
C  -0.747571 0.529193 0.191354
C  3.035483 -0.080045 0.572321
C  1.262007 -1.562586 -0.466406
C  0.721703 0.761113 0.442418
C  -1.445571 1.32424 -0.767222
C  -1.466794 -0.391491 0.992735
C  -2.840856 1.133265 -0.907587
C  -3.569646 0.205724 -0.119516
C  3.731192 0.697572 -0.557412
C  1.203654 -2.76885 0.48678
C  -2.8601 -0.549593 0.846725
C  -0.724894 2.357372 -1.615177
C  -5.063244 0.020464 -0.316919
H  3.533581 -1.052969 0.725211
H  3.099737 0.504126 1.504706
H  2.023826 -1.757971 -1.245634
H  0.290604 -1.442665 -0.97157
H  -0.938131 -0.959857 1.766971
H  -3.378752 1.735701 -1.65073
H  3.674739 0.181106 -1.527802
H  3.35352 1.726322 -0.625809
H  2.143639 -2.926333 1.036174
H  0.352893 -2.715167 1.179735
H  -3.39778 -1.257237 1.488402
H  -1.408917 2.813967 -2.3501
H  -0.303291 3.155582 -0.979108
H  0.123666 1.913669 -2.170028
H  -5.549764 0.958848 -0.636086
H  -5.268487 -0.737468 -1.097906
H  -5.554731 -0.322559 0.610133
