program: Gaussian 09
title: 000249734
version: EM64L-G09RevD.01
frameworkgroup: C1[X(C7H3Cl6N)]
method: RPBEPBE
basis: SDD
operation: Freq
keyword: #p
keyword: freq=noraman
keyword: PBEPBE/SDD
title: #p freq=noraman PBEPBE/SDD
converged: NO YES NO YES
title: Mulliken charges:
elementType: Cl Cl Cl Cl Cl Cl N C C C C C C C H H H
charge: 0.088496 0.154274 0.088495 0.088496 0.154274 0.088494 0.037373 0.337266 0.337266 -0.231105 -0.231105 -0.169695 -0.777429 -0.777429 0.278445 0.278444 0.255440
chargesum: 0.00000
title: Mulliken charges with hydrogens summed into heavy atoms:
elementType: Cl Cl Cl Cl Cl Cl N C C C C C C C
charge: 0.088496 0.154274 0.088495 0.088496 0.154274 0.088494 0.037373 0.337266 0.337266 0.047340 0.047340 0.085745 -0.777429 -0.777429
polarizability: 1.70472871e+02 1.26079227e-05 1.41737495e+02 5.14679235e-03 -2.41449371e-03 1.08260662e+02
1716.lowfreq: -18.7852 -14.3300 -11.0658 -2.8170 -2.5766 0.0008 0.0016 0.0018 81.3270
frequency: -18.5583 -13.0208 81.3270 87.3729 104.5032 158.6467 161.0018 204.3008 222.2188 233.1837 240.3088 253.1886 273.5455 312.8425 322.3225 373.1787 375.5578 412.0854 437.1392 560.3905 614.6584 637.0615 656.4885 740.5759 741.8326 744.9579 764.6077 824.7958 830.3126 921.8355 955.3382 976.4538 997.1129 1089.3750 1179.6056 1196.0715 1238.9715 1347.4970 1382.4949 1424.9817 1560.9605 1568.8022 3157.9470 3174.9921 3186.0228
redmass: 13.5063 32.3564 23.7507 8.8550 8.0456 21.5788 32.9226 6.8354 23.9417 20.1839 12.1679 13.8968 11.5805 17.2771 19.5694 17.1043 24.0819 9.4317 3.8542 8.4310 8.9786 9.0749 9.8071 12.3809 1.6890 8.0507 10.2735 10.2590 2.5516 1.4274 6.9319 6.1566 1.3666 1.6771 1.1452 2.2193 5.5911 10.0259 3.6097 2.1843 5.2098 7.1811 1.0886 1.0937 1.1007
irintensity: 1.4588 0.0000 0.6036 0.0000 1.8485 2.9850 0.3633 0.0000 0.9084 1.2072 1.4196 2.7971 0.0000 0.2499 3.6704 1.1622 0.1884 14.4073 8.6535 0.0000 24.0751 87.7237 299.4706 120.7659 106.0150 0.0000 40.5453 90.7043 0.0567 0.0000 1.1050 77.4524 0.0434 0.4936 2.4392 1.6852 29.1210 0.0192 16.9828 36.4593 5.4191 13.8442 4.3507 0.8844 1.7167
temp: 298.150 k
press: 1.00000 atm
elementType: 17 17 17 17 17 17 7 6 6 6 6 6 6 6 1 1 1
symmnumber: 1
zpe: 219675.4 jmol-1
zpe.correction: 0.083670 hartree
zpe.thermalcorrener: 0.096486 hartree
zpe.thermalcorrenthalpy: 0.097430 hartree
zpe.thermalcorrgfe: 0.043074 hartree
zpe.sumelectzpe: -3082.601601 hartree
zpe.sumelectthermal: -3082.588785 hartree
zpe.sumelectthermalent: -3082.587841 hartree
zpe.sumelectthermalfe: -3082.642197 hartree
dipole: 0.0000 -4.3614 0.0003
dipole: 4.3614
quadrupole: -129.6233 -109.6418 -123.6084
quadrupole: 0.0000 -0.0004 -0.0010
quadrupole: -8.6655 11.3161 -2.6506 0.0000 -0.0004 -0.0010
hfenergy: -3082.6852709 hartree
pointgroup: C01 [X(C7H3Cl6N1)]
dipole: 0.0000218 -1.7158908 -0.0001189 debye
dipolederiv: -0.4666501 -0.0202034 0.2894615 -0.0416211 -0.2082647 0.1540076 0.2973835 0.1183608 -0.592398 -0.1040255 -0.0736442 0.000001 -0.0679213 -0.6468733 -0.0000048 0.0000076 -0.0000138 -0.1134405 -0.4665752 -0.0201909 -0.2894511 -0.0416033 -0.2082499 -0.1539933 -0.2973539 -0.1183492 -0.5924614 -0.4666418 0.0201406 0.2894637 0.0415559 -0.2082172 -0.1539351 0.2973956 -0.1182863 -0.5924601 -0.1040289 0.0736587 0.0000143 0.067936 -0.6468691 -0.0000935 0.0000229 -0.00008 -0.1134403 -0.4665869 0.0202402 -0.289457 0.041655 -0.2082946 0.1540509 -0.2973479 0.1184081 -0.5923994 -0.4699369 -0.0000033 -0.0000257 -0.0000034 -0.214725 -0.0000023 -0.0000363 0.0000012 -0.2065402 0.2648916 -0.120826 0.0000216 -0.2956237 -0.0817192 -0.0000186 -0.0000147 0.0000067 -0.0786543 0.2648808 0.1208352 0.0000357 0.2956331 -0.0817081 0.0000187 0.0000088 -0.0000164 -0.0786542 -0.1426828 0.1085118 0.0000004 0.2293142 -0.1061421 0.0000096 0.0000132 0.0000094 -0.0578432 -0.1426731 -0.1085129 -0.0000182 -0.2293159 -0.1061508 -0.0000139 -0.0000206 -0.0000164 -0.0578431 0.0971576 -0.0000015 0.0000135 -0.0000014 0.2118132 0.000021 0.000022 0.0000218 -0.0879133 1.0481243 0.0948252 -0.000015 0.0679772 1.1756604 -0.0000143 -0.0000201 -0.0000124 1.3737724 1.0481282 -0.0948288 -0.0000196 -0.0679809 1.1756565 -0.0000121 -0.0000243 -0.0000155 1.3737722 0.0141019 -0.0478664 -0.0000131 -0.0709779 0.1078331 -0.0000079 -0.0000187 -0.0000075 0.1347026 0.0140984 0.0478641 -0.0000054 0.0709758 0.1078359 0.000003 -0.0000091 0.0000046 0.1347025 0.0784186 0.0000018 -0.0000066 0.0000019 -0.0615852 -0.0000151 -0.0000078 -0.0000151 0.1470982 unknown
polarizability: 170.4728713|0.0003677|141.7374946|0.0051468|0.0024146|108.2606621 unknown
InChI: InChI=1S/C7H3Cl6N/c8-6(9,10)4-2-1-3-5(14-4)7(11,12)13/h1-3H
charge 0 multiplicity 1
17 atoms
Cl -3.478046 0.059198 1.515961
Cl -2.197998 2.340907 -0.000109
Cl -3.47791 0.059256 -1.516375
Cl 3.47799 0.059553 -1.515963
Cl 2.197924 2.340965 0.000538
Cl 3.477939 0.059085 1.516373
N  -0.000011 0.408179 0.000051
C  -1.165859 -0.280649 -0.000105
C  1.165855 -0.280618 0.000106
C  -1.219152 -1.696648 -0.00021
C  1.219185 -1.696615 0.000002
C  0.000026 -2.406581 -0.000155
C  -2.4653 0.524179 -0.000153
C  2.465274 0.524245 0.00026
H  -2.179658 -2.217892 -0.000332
H  2.179705 -2.217835 0.000045
H  0.00004 -3.500627 -0.000234
