program: Gaussian 09
title: 000249726
version: EM64L-G09RevD.01
frameworkgroup: C1[X(C9H10O5)]
method: RPBEPBE
basis: SDD
operation: Freq
keyword: #pfreq=noraman
keyword: PBEPBE/SDD
title: #p freq=noraman PBEPBE/SDD
converged: YES YES NO NO
title: Mulliken charges:
elementType: O O O O O C C C C C C C C C H H H H H H H H H H
charge: -0.248563 -0.422814 -0.422644 -0.201732 -0.210020 0.120972 -0.519520 -0.708964 0.360054 0.166442 0.160129 -0.400558 -0.264162 -0.171139 0.256147 0.239017 0.220106 0.255605 0.250820 0.264789 0.250165 0.255164 0.385857 0.384850
chargesum: 0.00000
title: Mulliken charges with hydrogens summed into heavy atoms:
elementType: O O O O O C C C C C C C C C
charge: -0.248563 -0.036958 -0.037794 -0.201732 -0.210020 0.120972 -0.024356 0.017567 0.360054 0.166442 0.160129 -0.135770 -0.013998 0.084026
polarizability: 1.18024469e+02 2.32383244e+00 1.10960672e+02 1.19015276e+01 2.03212908e+00 8.69135088e+01
1716.lowfreq: -7.2312 -4.8933 -0.0009 -0.0008 -0.0007 11.6984 30.7055 42.4309 61.9602
frequency: 30.6062 42.3647 61.9294 70.7711 85.5078 167.3984 193.7352 205.9731 236.3119 273.2845 280.1270 316.3088 347.5224 375.8828 445.1686 522.8669 566.2296 592.0029 597.2715 611.7514 634.6132 677.2063 706.8146 723.0911 726.0186 750.3238 807.1715 826.0134 871.0196 877.0785 879.1283 926.1688 944.4261 1007.8644 1013.4666 1046.4836 1059.2138 1075.1332 1115.0319 1133.8249 1143.7066 1203.4712 1219.6942 1259.4985 1282.8200 1318.3497 1329.7909 1367.9872 1390.6513 1440.9084 1469.8454 1480.3546 1489.3526 1595.0022 1647.1197 1679.9249 2999.3729 3021.5178 3092.4673 3098.8457 3122.2580 3221.2371 3240.9495 3268.0760 3507.3597 3522.8628
redmass: 8.5416 5.2764 6.9425 7.0756 5.6531 7.1506 4.4064 4.7396 1.1485 2.9479 3.3078 7.0425 2.1729 5.2807 5.0867 3.6965 3.5161 2.5174 1.7746 1.3409 3.2172 3.7673 4.3867 1.3154 4.8699 4.4932 2.6447 1.3213 6.0942 2.9934 1.5250 2.0924 2.0660 1.6888 2.0770 2.7233 3.3090 5.0462 1.6051 1.5357 2.4947 2.4958 1.6436 1.3936 1.8764 2.3833 1.6300 2.3004 1.2116 1.0937 1.0573 1.0761 4.8815 6.9177 9.6391 9.4067 1.0355 1.0610 1.1011 1.0999 1.1010 1.0913 1.0993 1.1085 1.0638 1.0640
irintensity: 2.3047 1.4825 0.2293 0.2337 1.4628 0.7930 0.3190 2.7404 0.0671 0.9135 0.8111 1.0206 4.5515 2.2810 2.6417 1.7591 87.3881 61.4481 45.0662 151.0647 29.8563 7.3804 23.9471 86.2157 8.8838 9.7299 3.0303 34.1091 2.4303 1.5735 2.5262 24.8073 20.0665 161.2091 281.1465 2.0987 26.7195 6.4137 51.9697 19.6554 5.3761 11.4111 7.8352 1.0163 0.8819 40.6617 4.2201 1.4365 13.4018 6.7153 18.6841 18.0486 15.9466 6.4414 108.9430 293.4914 18.2758 13.6558 1.7847 16.3626 9.3524 4.3575 0.4058 0.5824 29.6989 33.2281
temp: 298.150 k
press: 1.00000 atm
elementType: 8 8 8 8 8 6 6 6 6 6 6 6 6 6 1 1 1 1 1 1 1 1 1 1
symmnumber: 1
zpe: 467958.4 jmol-1
zpe.correction: 0.178236 hartree
zpe.thermalcorrener: 0.191978 hartree
zpe.thermalcorrenthalpy: 0.192922 hartree
zpe.thermalcorrgfe: 0.136510 hartree
zpe.sumelectzpe: -724.012225 hartree
zpe.sumelectthermal: -723.998483 hartree
zpe.sumelectthermalent: -723.997539 hartree
zpe.sumelectthermalfe: -724.053950 hartree
dipole: -0.6658 -0.6534 2.5197
dipole: 2.6869
quadrupole: -78.7145 -65.7257 -87.8379
quadrupole: 0.0433 8.7582 -1.0891
quadrupole: -1.2885 11.7004 -10.4119 0.0433 8.7582 -1.0891
hfenergy: -724.1904608 hartree
pointgroup: C01 [X(C9H10O5)]
dipole: -0.3088629 0.3026092 -0.9646074 debye
dipolederiv: -0.4081202 0.142762 0.1444807 0.1029727 -0.5410587 -0.0815402 0.1417388 -0.1115456 -0.2019107 -0.4353203 0.1774851 0.0468043 0.2748052 -0.9994677 -0.4066879 0.0637208 -0.2934952 -0.4588859 -0.6054382 0.2646063 -0.0723751 0.406201 -0.8945331 0.2386405 -0.0622893 0.1564897 -0.334575 -0.3183178 0.0639539 0.1825554 0.0158789 -0.5568487 0.1435288 0.1529977 -0.0941966 -0.8399635 -0.6448249 0.0929035 -0.2857983 -0.0998922 -0.5514162 -0.1695073 -0.4023019 -0.0067676 -0.6284381 0.0055657 0.086863 0.0595741 0.0881098 -0.1684047 0.0019441 0.0033328 0.0361746 -0.1951981 0.2491146 -0.0826616 0.0688763 0.0172189 0.0026619 0.0258033 0.0223122 0.0106057 0.1356314 -0.0307684 -0.0403529 -0.0369113 0.010984 -0.0269297 -0.0507975 -0.0568534 -0.0459674 0.0541237 0.1757488 -0.0321534 -0.1069373 0.0174804 0.3457796 0.0246152 -0.1203844 0.0263623 -0.0473026 0.2495067 -0.1705433 -0.3208378 -0.3207792 1.3626115 0.0827305 -0.2569029 0.1247413 1.1065088 0.8272649 -0.322846 0.4782822 -0.2683317 1.2282944 0.1232097 0.5958724 0.1096202 0.7163739 -0.1414465 0.0929008 -0.0342828 0.0819687 -0.0338588 -0.0104476 -0.0303402 -0.0060284 -0.159913 -0.0382262 -0.0002387 -0.1115913 0.014149 -0.1018141 -0.0174149 -0.1035156 0.0164073 -0.1427634 0.0696169 -0.1199339 -0.1624877 -0.1764767 0.1923085 0.1056041 -0.1364296 0.0708216 -0.0436248 0.01752 0.0170468 0.0081701 -0.0163651 -0.0004437 0.0988949 0.0332126 0.0810707 0.0580205 0.0140591 -0.0049013 0.0219674 0.0103832 0.0024074 -0.1195997 0.0197676 -0.071692 0.0075979 0.0863728 0.012088 0.0019014 -0.0201652 -0.0577841 0.1307529 0.0429306 0.1082899 0.0103837 0.0980729 -0.0101263 -0.0034864 -0.0120466 0.0044918 -0.1046974 0.0056793 -0.0982521 0.032502 -0.083912 0.0031635 -0.0404467 0.0135055 0.1089398 0.0026834 -0.0858382 0.0147506 0.0316574 0.1605309 -0.0534101 0.0363587 -0.0500596 -0.0140598 0.0001171 0.0340055 -0.0015119 0.1648283 0.0113492 0.0371847 0.0960338 0.0468267 0.1101835 -0.0308125 0.1097462 -0.0270081 0.1422288 0.0940738 -0.0320299 0.060805 -0.0556803 0.0228953 0.0135693 0.0711422 0.0057263 0.1837476 0.3656612 -0.073702 0.0721345 -0.0530442 0.2852576 0.077323 0.0694075 0.1184234 0.1836788 0.2819171 -0.048058 -0.1027893 -0.0276432 0.2807879 -0.0779119 -0.1110108 -0.1230189 0.2252924 unknown
polarizability: 117.9450764|-0.4846169|110.2822113|-12.761178|2.521535|87.6713618 unknown
InChI: InChI=1S/C9H10O5/c1-9(7(10)11,8(12)13)5-6-3-2-4-14-6/h2-4,10,12H,5H2,1H3
charge 0 multiplicity 1
24 atoms
O  -1.852654 -1.128387 -0.460157
O  1.463328 -2.292056 -0.325577
O  0.783266 2.452167 0.046095
O  0.750634 -1.164612 1.571762
O  2.383656 1.384728 1.334464
C  1.297394 0.117683 -0.493634
C  -0.002925 0.233349 -1.378114
C  2.539726 0.023041 -1.431371
C  -1.311645 0.169306 -0.653502
C  1.155451 -1.130427 0.394947
C  1.540179 1.331495 0.418687
C  -2.18159 1.103317 -0.115118
C  -3.308068 0.381524 0.441904
C  -3.074046 -0.962857 0.217111
H  0.060088 1.187498 -1.926259
H  0.040857 -0.589942 -2.114274
H  2.594043 0.921461 -2.072152
H  2.457292 -0.869831 -2.070409
H  3.469541 -0.048957 -0.843407
H  -2.021495 2.17879 -0.109078
H  -4.173787 0.808804 0.943992
H  -3.613933 -1.877172 0.445947
H  1.25944 -3.083588 0.242155
H  1.03255 3.211667 0.640487
