program: Gaussian 09
title: 000249723
version: EM64L-G09RevD.01
frameworkgroup: C1[X(C14H18O3)]
method: RPBEPBE
basis: SDD
operation: Freq
keyword: #pfreq=noraman
keyword: PBEPBE/SDD
title: #p freq=noraman PBEPBE/SDD
converged: YES YES NO NO
title: Mulliken charges:
elementType: O O O C C C C C C C C C C C C C C H H H H H H H H H H H H H H H H H H
charge: -0.291657 -0.275313 -0.261325 -0.370579 -0.344449 -0.252680 -0.687810 0.217547 0.177738 -0.326259 -0.343724 0.359301 -0.374532 -0.337795 -0.318056 -0.109316 -0.548247 0.206371 0.206284 0.197467 0.197172 0.221727 0.224141 0.218651 0.211534 0.211241 0.271913 0.268437 0.255531 0.246637 0.229057 0.229081 0.250354 0.226589 0.214968
chargesum: 0.00000
title: Mulliken charges with hydrogens summed into heavy atoms:
elementType: O O O C C C C C C C C C C C C C C
charge: -0.291657 -0.275313 -0.261325 0.042076 0.050190 0.193187 -0.046384 0.217547 0.177738 -0.054346 -0.075286 0.359301 -0.119002 -0.091158 0.140082 0.141038 -0.106690
polarizability: 2.67213076e+02 1.91072714e+01 1.64975917e+02 7.76942873e-01 -1.33094731e+00 8.71896490e+01
1716.lowfreq: -99.4002 -9.2284 -1.2308 -0.0004 0.0007 0.0012 4.6245 23.1685 35.2542
frequency: -99.3993 22.6461 35.2364 36.5883 54.4575 67.2288 91.8938 105.0944 109.1138 128.1509 157.5610 172.2350 209.6870 232.6011 253.4443 280.8301 306.1437 342.2670 405.3537 417.7658 433.6824 479.0081 506.2081 517.2145 558.3046 625.9911 636.9302 677.2554 739.3154 754.7858 774.1271 796.6467 816.1901 822.5834 854.3585 898.0986 907.7734 918.8788 930.6648 938.4654 969.4005 984.8076 991.5414 993.5494 1000.9899 1014.8583 1038.8263 1060.2022 1081.0104 1118.3405 1124.4078 1138.4326 1147.6053 1175.7178 1194.0135 1211.5490 1231.3940 1247.8913 1269.0342 1272.6677 1278.4432 1286.1369 1301.3522 1337.0743 1343.5676 1372.9836 1381.6834 1390.7509 1427.3418 1430.9832 1464.6961 1469.0849 1472.6572 1477.3238 1480.9310 1490.3289 1497.3823 1572.1895 1615.0349 1619.8329 1663.9890 2946.8656 2970.0074 2975.5715 2989.2211 2999.5046 3002.9554 3012.8566 3042.2250 3068.4161 3076.2634 3076.8992 3093.6492 3132.9115 3153.6102 3157.3624 3173.6098 3179.2547 3204.1609
redmass: 1.9275 3.1382 3.2284 4.1958 2.2148 4.5644 4.2430 2.6476 2.8370 2.3283 3.9888 3.7752 5.0886 1.1365 5.2400 4.3067 6.5209 3.6476 3.7000 2.9869 4.5820 4.3548 2.9419 4.7632 1.3902 6.9569 7.5454 4.1560 1.0707 4.5385 7.1054 1.1466 6.8507 1.3186 1.6119 2.5802 1.9208 3.3805 1.1630 1.3166 1.3643 1.0888 1.3400 4.6049 3.1959 1.6243 3.2733 4.4997 2.2176 1.3616 2.5453 2.0916 1.4847 1.2322 1.0593 1.3508 3.0398 3.0418 1.1740 1.3879 1.2946 1.0827 1.2883 1.3094 1.4595 1.5761 5.3114 1.2197 3.7501 1.2406 1.1374 1.0785 1.0663 1.0425 1.0652 1.0953 2.3897 8.1424 9.8226 6.7840 4.9384 1.0551 1.0583 1.0369 1.0597 1.0567 1.1059 1.1002 1.1036 1.1044 1.0995 1.1043 1.0618 1.0941 1.0883 1.0877 1.0967 1.0967 1.1136
irintensity: 3.0987 0.4937 0.0124 0.3202 0.2099 0.1071 0.1410 0.0079 0.0080 3.9385 0.5168 9.0575 1.1793 0.2348 8.1891 4.1916 0.0100 1.3848 11.1716 0.0438 2.7804 1.0302 6.2788 1.9378 23.3687 5.0386 15.6388 24.2981 9.7347 15.7216 15.4784 1.2611 5.5570 8.4489 52.5206 20.0917 8.0543 3.3584 0.3608 75.8048 0.0346 27.6337 0.0234 123.2191 28.7253 6.7998 1.0456 414.4161 1.1172 6.4081 1.3017 13.3024 2.2112 239.8692 0.7519 0.0548 152.9669 463.6878 6.4569 59.6308 12.9733 0.0962 0.0334 9.3082 5.1070 5.2149 1.7627 8.8026 22.8705 24.1394 50.4838 0.4774 0.3763 13.0404 4.8838 23.9286 62.0543 64.9480 112.0099 302.7254 11.1710 22.9819 27.6044 31.3774 15.0444 48.7830 32.1718 5.7824 2.2601 0.2008 53.9376 128.6317 8.7404 2.7057 0.5937 9.9100 7.1949 5.8625 22.0098
temp: 298.150 k
press: 1.00000 atm
elementType: 8 8 8 6 6 6 6 6 6 6 6 6 6 6 6 6 6 1 1 1 1 1 1 1 1 1 1 1 1 1 1 1 1 1 1
symmnumber: 1
zpe: 753109.8 jmol-1
zpe.correction: 0.286844 hartree
zpe.thermalcorrener: 0.304409 hartree
zpe.thermalcorrenthalpy: 0.305353 hartree
zpe.thermalcorrgfe: 0.238506 hartree
zpe.sumelectzpe: -768.652433 hartree
zpe.sumelectthermal: -768.634869 hartree
zpe.sumelectthermalent: -768.633925 hartree
zpe.sumelectthermalfe: -768.700772 hartree
dipole: -0.8259 -3.7235 0.0600
dipole: 3.8145
quadrupole: -82.6470 -102.0280 -104.7853
quadrupole: 0.2383 0.0232 -0.3393
quadrupole: 13.8398 -5.5412 -8.2985 0.2383 0.0232 -0.3393
hfenergy: -768.9392773 hartree
pointgroup: C01 [X(C14H18O3)]
dipole: 0.3257935 1.4548689 -0.1715994 debye
polarizability: 267.0494743|18.2434245|163.9181419|-8.0039283|-8.9995153|88.4110258 unknown
InChI: InChI=1S/C14H18O3/c1-3-5-11-17-14(15)12-6-8-13(9-7-12)16-10-4-2/h4,6-9H,2-3,5,10-11H2,1H3
charge 0 multiplicity 1
35 atoms
O  -2.507851 -0.157368 0.115942
O  3.912442 -0.335471 -0.104964
O  -2.186855 -2.454876 0.359922
C  -4.660293 0.960964 -0.020018
C  -6.201544 0.843472 0.054829
C  -3.978166 -0.389894 0.197112
C  -6.905471 2.196916 -0.181465
C  -0.256425 -0.981593 0.124249
C  -1.704269 -1.301756 0.214035
C  0.677532 -2.052986 0.194386
C  0.221806 0.343706 -0.026722
C  2.523786 -0.473141 -0.036211
C  2.054518 -1.805106 0.114736
C  1.604096 0.60647 -0.106723
C  4.469914 1.022178 -0.258371
C  5.974343 0.86616 -0.301709
C  6.851148 1.889164 -0.438435
H  -4.302492 1.678719 0.7434
H  -4.363011 1.364581 -1.007227
H  -6.493769 0.441325 1.046042
H  -6.552779 0.107611 -0.696786
H  -4.210917 -0.82145 1.188821
H  -4.261502 -1.131468 -0.572992
H  -8.004417 2.094364 -0.124888
H  -6.653859 2.604737 -1.178354
H  -6.595627 2.942657 0.574575
H  0.295931 -3.072368 0.31147
H  -0.498184 1.16499 -0.080299
H  2.786633 -2.616193 0.166229
H  1.948442 1.638007 -0.221887
H  4.081488 1.478795 -1.192462
H  4.150959 1.651863 0.59823
H  6.327207 -0.169063 -0.211192
H  7.930324 1.707795 -0.461898
H  6.52696 2.933557 -0.530673
