program: Gaussian 09
title: 000249718
version: EM64L-G09RevD.01
frameworkgroup: C1[X(C8H17N)]
method: RPBEPBE
basis: SDD
operation: Freq
keyword: #pfreq=noraman
keyword: PBEPBE/SDD
title: #p freq=noraman PBEPBE/SDD
converged: YES YES NO NO
title: Mulliken charges:
elementType: N C C C C C C C C H H H H H H H H H H H H H H H H H
charge: -0.245885 -0.036343 -0.105711 -0.167604 -0.485585 -0.424502 -0.766077 -0.731926 -0.705957 0.189133 0.225560 0.209784 0.208707 0.221578 0.239202 0.212511 0.200734 0.220656 0.218499 0.222265 0.199666 0.237258 0.218302 0.220601 0.210298 0.214835
chargesum: 0.00000
title: Mulliken charges with hydrogens summed into heavy atoms:
elementType: N C C C C C C C C
charge: -0.006682 0.152790 0.119849 0.042180 -0.055301 -0.011256 -0.104657 -0.076700 -0.060223
polarizability: 9.61560470e+01 -3.85923367e-01 9.65100680e+01 -1.72964316e+00 -6.60923881e-01 7.88051875e+01
1716.lowfreq: -16.4647 -13.0819 -0.0005 0.0005 0.0006 15.5780 47.4004 109.9023 114.6526
frequency: 47.3152 109.8857 114.5498 175.3734 195.0635 218.9221 246.8872 265.8315 294.6011 374.0119 387.2339 427.2017 510.7073 572.8842 655.0455 684.9746 729.0989 811.6545 848.5747 870.4399 907.5696 929.1642 938.6067 1013.4886 1020.6206 1038.1326 1043.6802 1080.3347 1098.3069 1131.4037 1137.0148 1152.0453 1170.4350 1228.3187 1243.3272 1251.5855 1261.9173 1305.1842 1306.1682 1322.7552 1335.7028 1345.3331 1347.1529 1383.0435 1386.5091 1390.6407 1428.1947 1466.0090 1471.1244 1472.8215 1476.6019 1478.8523 1483.8467 1485.8924 1490.6740 2926.4233 2954.5247 2970.8297 2971.7719 2973.2276 2976.1321 2979.2941 3000.6037 3022.4927 3042.2509 3063.3205 3065.1420 3068.1673 3070.5314 3073.8348 3087.1362 3400.5218
redmass: 2.2268 2.5347 2.1510 1.6880 1.4508 1.1063 1.1414 2.5138 1.7325 2.2997 2.6343 2.5926 2.4118 3.0648 4.5505 1.5664 1.8025 1.4753 2.0165 1.6286 2.0339 1.3305 1.6991 1.9994 1.6442 1.7198 2.2936 1.6179 1.9944 2.8609 2.0767 2.3550 2.4774 1.3784 1.4358 1.2540 1.2661 1.2181 1.2404 1.3156 1.4167 1.4169 1.5641 1.2195 1.2431 1.2054 1.1749 1.0599 1.0502 1.0496 1.0476 1.0464 1.0631 1.0651 1.0675 1.0809 1.0841 1.0393 1.0391 1.0369 1.0584 1.0607 1.0874 1.0991 1.1019 1.0988 1.0962 1.0995 1.0997 1.0990 1.0992 1.0749
irintensity: 1.4735 3.8841 1.2303 0.0513 0.1108 0.3849 0.1733 0.6523 0.0258 1.4330 3.2900 0.3433 4.6789 4.8170 20.3326 100.3807 17.3382 3.8594 2.0376 1.8431 8.7803 3.2490 14.1274 2.4912 8.8456 3.3434 9.3787 4.0493 1.6921 6.2829 7.8447 6.4692 5.6373 0.7351 0.4943 0.9776 1.8239 0.5584 1.5315 1.1940 0.9146 0.3458 3.4263 21.8701 18.1608 15.5086 12.3129 8.4659 6.5137 12.5512 11.8391 8.9594 7.0818 5.7804 3.7069 11.6448 33.2591 43.2792 12.5777 41.3550 49.0464 63.5717 21.5485 24.6665 41.7037 38.3404 41.4757 78.4136 69.1291 32.7042 30.0625 2.7300
temp: 298.150 k
press: 1.00000 atm
elementType: 7 6 6 6 6 6 6 6 6 1 1 1 1 1 1 1 1 1 1 1 1 1 1 1 1 1
symmnumber: 1
zpe: 623307.7 jmol-1
zpe.correction: 0.237405 hartree
zpe.thermalcorrener: 0.248074 hartree
zpe.thermalcorrenthalpy: 0.249019 hartree
zpe.thermalcorrgfe: 0.201739 hartree
zpe.sumelectzpe: -369.033172 hartree
zpe.sumelectthermal: -369.022503 hartree
zpe.sumelectthermalent: -369.021559 hartree
zpe.sumelectthermalfe: -369.068838 hartree
dipole: -1.1646 -0.4114 -0.9773
dipole: 1.5750
quadrupole: -63.7627 -57.1293 -56.7188
quadrupole: -1.3742 -3.0612 -0.7190
quadrupole: -4.5591 2.0743 2.4848 -1.3742 -3.0612 -0.7190
hfenergy: -369.2705773 hartree
pointgroup: C01 [X(C8H17N1)]
dipole: 0.4795334 -0.1375264 0.3675554 debye
dipolederiv: -0.8008968 -0.0425538 0.0627876 0.0715364 -0.49428 -0.0887738 -0.1788445 -0.1539764 -0.138175 -0.101096 0.049473 -0.0187364 -0.0777142 -0.00176 -0.0608368 -0.05427 -0.0605672 0.0778663 -0.0707174 -0.0087378 0.019731 0.0564284 0.0405674 -0.0141318 0.0068508 -0.0010277 0.1473365 0.3935845 -0.064116 -0.0611702 -0.0617911 0.2292078 0.0553059 0.0078009 0.1593784 0.2984598 0.2358506 0.0689436 0.0100099 0.0701329 0.4101917 -0.0195801 0.0431762 -0.0597379 0.1883673 0.0498031 0.003675 0.0029933 0.012016 0.1112984 -0.0405574 -0.0286567 -0.0305086 0.1043868 0.0440481 -0.0414335 0.0469823 -0.0209744 0.0016214 0.0743111 0.0336434 0.0542928 -0.0270306 0.014408 -0.0309508 0.008788 -0.0170673 -0.1004744 -0.0176845 -0.0170719 -0.0251682 0.1051674 -0.0482878 -0.0100576 -0.0472978 -0.019291 0.0797376 -0.0173481 -0.0286835 -0.0187464 0.0543733 0.0332044 -0.0090881 0.0322169 -0.0032046 -0.0317868 0.0907329 0.0232691 0.0847206 -0.1699777 -0.0146544 -0.0671676 -0.080338 -0.0670457 -0.0073345 -0.031765 -0.0957745 -0.0579607 -0.1258245 0.0031583 0.0189694 0.0518348 0.0010312 0.0033764 0.064777 0.0406444 0.020402 -0.1864383 0.0264744 0.0067307 0.0566479 0.013072 -0.0204444 -0.0690572 0.0981833 -0.1353361 -0.1220462 0.0201938 0.0247171 -0.0290842 0.0235382 -0.1291912 0.0821724 -0.0436678 0.1714214 -0.0353154 0.2869029 0.0242406 -0.0519264 -0.0476979 0.0573224 0.0755212 0.1175305 0.0650183 -0.0384201 0.0126183 0.0073558 -0.0185027 -0.0210241 0.0657467 0.0985239 0.0077002 0.0699353 -0.1495785 0.0330396 -0.030737 -0.0210887 -0.0126339 -0.2057213 -0.0526112 -0.010075 -0.0328106 0.0596381 0.0333685 -0.0296308 -0.0974975 -0.0418642 0.0615654 -0.0908522 -0.0602989 -0.0456413 -0.0870864 0.0808087 0.0693753 0.0015635 0.0236618 -0.1969454 0.0125722 0.0152648 -0.021739 0.0784222 -0.1934714 0.0080068 0.0472084 0.0371645 0.1076073 -0.0104952 0.0356124 -0.0011865 0.0657822 0.0865499 -0.0093158 -0.0126426 -0.0049635 0.0539734 0.0006356 0.0278241 0.0927086 -0.1682882 -0.1311692 -0.1054571 -0.086112 -0.0413103 0.0669476 -0.0069961 -0.0811948 -0.0165108 0.0599349 0.0049065 0.1389015 0.0847058 0.086955 -0.0214389 -0.0501905 0.077681 -0.0663498 0.0413611 0.0863137 -0.0336475 -0.0098925 -0.0746856 -0.1643023 -0.0370912 -0.0100038 -0.0287884 0.0719878 0.0740713 -0.0286207 0.0392121 0.0041592 0.0381324 0.0962012 -0.0331395 0.0943702 -0.1406959 -0.1590114 0.0911251 0.0696077 0.111572 0.0463832 -0.042782 0.1064997 -0.056192 0.0357932 unknown
polarizability: 95.9668476|0.3820936|96.5505246|-2.3855166|0.5267367|78.9539303 unknown
InChI: InChI=1S/C8H17N/c1-4-8-6(2)5-9-7(8)3/h6-9H,4-5H2,1-3H3
charge 0 multiplicity 1
26 atoms
N  -2.067898 0.172422 0.292259
C  0.293267 -0.351662 0.324643
C  0.193557 1.213043 0.402739
C  -1.068751 -0.751128 -0.328836
C  -1.360189 1.473575 0.51876
C  1.548221 -0.931591 -0.361929
C  0.779525 1.95561 -0.820806
C  -1.479209 -2.21861 -0.146309
C  2.854182 -0.684902 0.427472
H  0.263208 -0.742624 1.367466
H  0.711973 1.576903 1.310264
H  -1.020294 -0.524667 -1.415714
H  -1.64482 1.896866 1.499844
H  -1.667996 2.201787 -0.25645
H  -2.39472 -0.228946 1.185024
H  1.644061 -0.513792 -1.383391
H  1.412297 -2.024926 -0.488848
H  0.303676 1.61777 -1.760923
H  0.596046 3.042796 -0.730254
H  1.870299 1.809716 -0.919414
H  -1.509313 -2.4877 0.928632
H  -2.480854 -2.398052 -0.576081
H  -0.765893 -2.898175 -0.645197
H  3.053532 0.395127 0.553631
H  2.79367 -1.132559 1.437738
H  3.725523 -1.130683 -0.08712
