program: Gaussian 09
title: 000249705
version: EM64L-G09RevD.01
frameworkgroup: C1[X(C20H27FO3)]
method: RPBEPBE
basis: SDD
operation: Freq
keyword: #p
keyword: freq=noraman
keyword: PBEPBE/SDD
title: #p freq=noraman PBEPBE/SDD
converged: YES YES NO NO
title: Mulliken charges:
elementType: F O O O C C C C C C C C C C C C C C C C C C C C H H H H H H H H H H H H H H H H H H H H H H H H H H H
charge: -0.235782 -0.441306 -0.214698 -0.209624 -0.089385 0.358926 -0.259036 0.290440 0.106649 -0.611106 -0.232583 -0.211890 -0.545835 -0.447149 -0.480519 0.549997 -0.868682 -0.636799 -0.615006 -0.796260 0.167683 -0.558868 0.111931 -0.799850 0.254992 0.237213 0.235495 0.240271 0.242557 0.244262 0.218232 0.231669 0.224940 0.239672 0.262760 0.217172 0.227240 0.207757 0.284817 0.222962 0.244900 0.263351 0.250180 0.287991 0.234017 0.204987 0.277894 0.362375 0.245481 0.248466 0.257101
chargesum: 0.00000
title: Mulliken charges with hydrogens summed into heavy atoms:
elementType: F O O O C C C C C C C C C C C C C C C C C C C C
charge: -0.235782 -0.078931 -0.214698 -0.209624 0.165607 0.358926 -0.021824 0.290440 0.106649 -0.135341 0.009974 0.032372 -0.095934 0.017463 -0.000587 0.549997 -0.148868 -0.168937 -0.101476 -0.069265 0.167683 -0.280974 0.111931 -0.048802
polarizability: 2.69816472e+02 -6.82683830e+00 2.00911070e+02 -1.30474673e+01 6.66588765e+00 1.71528463e+02
1716.lowfreq: -8.9573 -0.0006 0.0003 0.0009 3.1532 7.5870 32.0266 47.6285 68.8302
frequency: 31.9238 47.6036 68.8140 71.0697 93.0882 108.0180 113.4807 127.6466 147.5978 156.9397 172.7901 196.7926 205.1668 211.2988 225.0527 245.9842 250.7056 270.0159 273.1064 286.5554 296.8250 303.9516 320.6164 335.4592 345.9036 364.4155 374.1192 390.0958 424.5987 459.7857 462.6669 494.0464 514.6170 524.8409 539.4969 545.7906 576.7773 582.0826 589.5081 604.1981 640.6322 669.1478 690.2423 699.2630 752.7676 787.9221 818.1137 833.8079 845.2477 851.0187 855.8099 867.9997 889.0729 906.2059 910.6843 917.3440 926.2063 936.2983 952.9323 961.5508 967.9872 992.1804 1005.0662 1015.7120 1021.9105 1041.6422 1042.4170 1055.5381 1067.6405 1077.0671 1092.3457 1103.7593 1110.8237 1128.1522 1149.1450 1156.4984 1165.6321 1169.4633 1178.4167 1183.3532 1202.2998 1204.6197 1212.0569 1214.0005 1218.7474 1227.5247 1247.4874 1252.5924 1253.5164 1271.6032 1287.1953 1290.5383 1299.4652 1314.9474 1317.4441 1321.7086 1331.1310 1341.5148 1346.9243 1357.3960 1367.2613 1369.7193 1373.6129 1389.8638 1404.3424 1420.9940 1442.0811 1448.1810 1454.0641 1458.8185 1466.8192 1466.9593 1471.9123 1479.0434 1492.6594 1497.1800 1507.2949 1622.0527 1628.7994 1638.4963 2957.4873 2962.3092 2970.6907 2976.5166 2976.9739 2984.3765 2987.7827 2989.8549 2993.7398 2997.2779 3015.9827 3017.6737 3042.9261 3047.7574 3048.4280 3052.2015 3055.9871 3059.4284 3060.8591 3075.6941 3080.3690 3084.6952 3086.4797 3120.4231 3122.6467 3177.4642 3586.5012
redmass: 7.0273 4.0509 5.0683 4.0112 3.0220 3.5046 1.1214 1.9217 1.9567 4.6278 2.2804 2.9200 2.9446 3.8784 4.2460 2.9563 2.2269 2.8995 1.6272 2.8385 2.4050 1.9536 1.9827 3.4285 3.3196 2.7198 3.2474 3.1652 3.3862 3.0978 3.3828 3.0593 3.4170 2.9668 3.9036 3.7266 3.2709 3.5875 3.2395 3.7740 3.4424 3.2522 3.0416 2.5860 3.4913 3.2499 2.2050 1.9686 2.6323 2.9070 2.4836 1.4353 2.1785 2.2761 2.3631 3.2194 2.1290 1.7902 2.1167 1.9603 1.9515 2.2363 2.1469 2.0309 2.1271 2.1310 2.2754 2.3492 2.1788 2.0569 3.0325 2.3281 1.7252 2.4141 1.6341 1.9633 1.8049 1.9090 1.9466 1.9224 1.6272 1.9472 1.7650 1.6801 1.6050 1.9938 1.8054 1.4667 1.4833 1.3624 1.5677 1.4261 1.4820 1.6523 2.2006 1.3300 1.5983 1.3498 1.5019 1.4266 1.1517 1.2521 1.4137 1.1907 1.1954 1.0864 1.0773 1.0718 1.0717 1.0891 1.0554 1.0845 1.0730 1.0736 1.0731 1.0533 1.0544 7.1535 10.0478 9.1492 1.0794 1.0658 1.0447 1.0566 1.0591 1.0655 1.0742 1.0382 1.0639 1.0603 1.0630 1.0611 1.0944 1.0922 1.0942 1.0991 1.0994 1.0949 1.1033 1.0992 1.1017 1.0967 1.1007 1.1003 1.0988 1.0978 1.0657
irintensity: 2.2222 4.0338 1.2166 3.9747 0.4293 9.2317 2.0554 51.9520 27.1153 1.1369 7.4303 3.5833 5.6285 0.3070 3.8426 1.2132 2.5616 6.0195 1.3454 3.4780 6.9559 1.0752 3.9335 7.0073 0.2045 0.9299 1.2608 1.4983 1.9004 1.2548 0.3512 5.3568 3.0474 2.3379 8.2142 1.8943 2.9979 10.3187 5.8266 7.8812 5.4547 0.4131 4.3045 4.9610 3.5624 1.6022 4.2523 14.7303 14.6463 17.0020 5.1471 12.4882 12.3731 0.6717 7.0946 6.4707 10.9725 11.4714 26.0294 7.8747 5.4634 20.0122 14.3043 7.8215 6.1626 11.4797 0.9636 5.6889 21.6849 5.3693 18.5050 1.0071 8.7191 1.2978 20.7752 26.8524 4.8596 37.4640 13.1716 14.7971 3.0625 36.5288 6.2944 7.5293 48.9095 11.4603 8.1587 8.7072 34.6264 6.2705 3.7512 14.2654 6.7637 5.4852 5.3064 2.2765 41.6142 1.3323 2.5813 6.0973 15.7724 63.0144 11.8376 20.9665 41.6697 11.7866 17.2940 10.8702 13.2465 18.2572 7.6334 5.8346 9.4844 6.7066 13.3528 5.5017 8.3516 127.2629 409.5582 1.2391 1.3510 17.1055 18.2506 10.1887 7.2507 15.4890 20.7055 24.1720 54.3308 30.9319 28.6896 4.6887 13.4089 18.4211 27.1699 45.1136 20.9645 8.1055 21.8878 35.4013 29.3719 12.0870 9.6417 15.4731 2.4829 4.4758 26.1586
temp: 298.150 k
press: 1.00000 atm
elementType: 9 8 8 8 6 6 6 6 6 6 6 6 6 6 6 6 6 6 6 6 6 6 6 6 1 1 1 1 1 1 1 1 1 1 1 1 1 1 1 1 1 1 1 1 1 1 1 1 1 1 1
symmnumber: 1
zpe: 1125900.5 jmol-1
zpe.correction: 0.428833 hartree
zpe.thermalcorrener: 0.452074 hartree
zpe.thermalcorrenthalpy: 0.453018 hartree
zpe.thermalcorrgfe: 0.378315 hartree
zpe.sumelectzpe: -1102.003351 hartree
zpe.sumelectthermal: -1101.980110 hartree
zpe.sumelectthermalent: -1101.979166 hartree
zpe.sumelectthermalfe: -1102.053869 hartree
dipole: -4.0916 2.8549 0.7633
dipole: 5.0473
quadrupole: -189.9684 -139.7601 -143.4371
quadrupole: 18.1719 20.7700 1.0572
quadrupole: -32.2466 17.9618 14.2848 18.1719 20.7700 1.0572
hfenergy: -1102.4321841 hartree
pointgroup: C01 [X(C20H27F1O3)]
dipole: -1.6143103 1.1181847 0.2946799 debye
polarizability: 270.0390849|-6.6636344|200.8027815|-12.3430844|6.7664492|171.4141383 unknown
InChI: InChI=1S/C20H27FO3/c1-11(22)14-6-7-15-16-5-4-12-8-13(23)9-19(12,3)20(16,21)17(24)10-18(14,15)2/h8,14-17,24H,4-7,9-10H2,1-3H3
charge 0 multiplicity 1
51 atoms
F  1.070352 -0.173976 -1.498847
O  0.080898 -2.105818 1.523509
O  -5.393892 -0.237697 0.588154
O  5.576044 -1.304557 -1.072284
C  -1.203828 1.08161 -0.255632
C  -2.086195 -0.160751 0.091301
C  0.19731 1.059989 0.39781
C  0.930423 -0.256353 0.001548
C  2.401884 -0.328012 0.530856
C  -1.349652 -1.42555 -0.418173
C  -3.388848 0.226434 -0.727984
C  0.086151 -1.569395 0.150874
C  -2.141797 2.283474 0.000994
C  1.013451 2.310836 -0.03089
C  -3.541122 1.765298 -0.476519
C  3.130157 0.972738 0.131611
C  -2.437313 -0.240259 1.606089
C  2.486244 2.289722 0.462365
C  3.257203 -1.436673 -0.152242
C  2.480613 -0.466605 2.085304
C  -4.629821 -0.589173 -0.353346
C  4.330557 0.727468 -0.471411
C  4.545953 -0.729843 -0.624608
C  -4.904226 -1.847964 -1.165545
H  -1.02742 1.031698 -1.351766
H  0.099086 1.068559 1.50338
H  -1.27104 -1.372238 -1.521035
H  -1.896444 -2.355203 -0.166682
H  -3.158788 0.033328 -1.795185
H  0.617971 -2.344411 -0.428028
H  -1.828321 3.187856 -0.548575
H  -2.161629 2.544193 1.076736
H  0.510936 3.217022 0.354155
H  1.004391 2.371557 -1.135376
H  -4.324158 1.941158 0.281099
H  -3.86271 2.270558 -1.404276
H  -2.846944 -1.234789 1.867659
H  -1.56523 -0.030299 2.254898
H  -3.217321 0.489095 1.881189
H  2.496795 2.434941 1.563277
H  3.051441 3.130571 0.022565
H  2.758816 -1.839528 -1.052484
H  3.490801 -2.284481 0.512767
H  2.032887 -1.417853 2.407361
H  3.542738 -0.435935 2.388623
H  1.958983 0.355281 2.608276
H  5.058942 1.471661 -0.802835
H  -0.694201 -1.74475 2.019467
H  -5.22922 -1.56357 -2.185959
H  -3.988886 -2.456418 -1.284019
H  -5.698819 -2.446546 -0.693659
