program: Gaussian 09
title: 000249697
version: EM64L-G09RevD.01
frameworkgroup: C1[X(C13H8BrF)]
method: RPBEPBE
basis: SDD
operation: Freq
keyword: #p
keyword: freq=noraman
keyword: PBEPBE/SDD
title: #p freq=noraman PBEPBE/SDD
converged: NO YES NO NO
title: Mulliken charges:
elementType: Br F C C C C C C C C C C C C C H H H H H H H H
charge: -0.015956 -0.187127 -0.779750 0.160250 0.353167 0.256890 0.184452 0.206234 -0.381947 -0.423476 -0.384711 -0.384800 -0.179937 -0.233831 -0.225346 0.332937 0.256241 0.247065 0.242838 0.258142 0.234354 0.232822 0.231490
chargesum: 0.00000
title: Mulliken charges with hydrogens summed into heavy atoms:
elementType: Br F C C C C C C C C C C C C C
charge: -0.015956 -0.187127 -0.446814 0.160250 0.353167 0.256890 0.184452 0.206234 -0.125706 -0.176412 -0.141873 -0.126659 0.054417 -0.001009 0.006144
polarizability: 2.18851518e+02 -7.10325457e+00 1.80781505e+02 3.60432802e+00 -1.34609001e+01 7.85998991e+01
1716.lowfreq: -8.5861 -7.6038 -3.7598 -0.0008 -0.0007 -0.0003 54.1864 87.5624 94.0439
frequency: 54.1741 87.5571 94.0414 124.7101 174.2051 212.1947 255.4639 292.8333 313.5114 421.0423 438.5308 443.7113 486.7644 522.9976 558.9491 576.2749 599.2952 624.4636 630.6610 692.1934 737.1020 765.7080 773.2814 806.3176 819.7027 846.0630 882.3732 889.9518 894.7395 955.1802 972.5837 991.9379 1020.9441 1051.2058 1060.6518 1107.4954 1117.3068 1160.0095 1170.3771 1184.2704 1193.0459 1202.3024 1223.7248 1284.4800 1302.6158 1379.6627 1395.1413 1436.0879 1451.0044 1469.7315 1485.2321 1590.3494 1596.4329 1619.7835 1631.4210 3095.9803 3130.6230 3139.5289 3142.2887 3151.1374 3160.8910 3168.0088 3182.1549
redmass: 8.3526 8.6463 7.2839 5.2983 6.0899 5.9622 5.6314 5.9073 6.2959 3.9229 4.4469 5.0600 6.8046 3.7783 6.2772 5.6485 4.2110 6.1828 4.2034 6.8131 1.8220 2.3156 1.7121 2.3513 3.9816 5.7220 1.6672 2.5872 1.8090 1.4198 1.3457 1.3387 2.2305 2.2681 3.0739 1.7342 1.1722 1.2931 1.1249 1.3948 2.6219 2.5290 2.1825 1.9537 1.9323 8.3821 3.2768 2.4165 2.9440 3.2392 4.5320 7.2519 6.6213 7.2998 9.3512 1.0879 1.0857 1.0896 1.0874 1.0952 1.0940 1.1004 1.0973
irintensity: 0.0926 0.1819 1.8374 1.1761 1.4270 1.4746 2.5984 0.9797 1.1630 1.3764 16.0804 2.5422 5.2007 0.0409 3.3851 1.1021 6.8129 29.5694 34.2991 6.9142 2.4886 85.4619 53.2473 16.0248 22.3430 8.6733 4.0143 6.9259 2.3265 1.5756 1.3727 0.1509 1.5535 3.9439 11.7931 8.7845 21.7060 4.5882 1.0903 2.2847 29.4598 21.0595 14.8840 1.3206 3.6647 2.8288 0.7125 29.6162 30.2911 13.3115 5.9104 31.6764 13.4529 3.0983 63.9310 1.8863 1.7862 4.1912 3.6746 18.8132 15.7364 29.2576 5.6604
temp: 298.150 k
press: 1.00000 atm
elementType: 35 9 6 6 6 6 6 6 6 6 6 6 6 6 6 1 1 1 1 1 1 1 1
symmnumber: 1
zpe: 438086.9 jmol-1
zpe.correction: 0.166858 hartree
zpe.thermalcorrener: 0.178467 hartree
zpe.thermalcorrenthalpy: 0.179411 hartree
zpe.thermalcorrgfe: 0.127825 hartree
zpe.sumelectzpe: -612.484960 hartree
zpe.sumelectthermal: -612.473352 hartree
zpe.sumelectthermalent: -612.472407 hartree
zpe.sumelectthermalfe: -612.523993 hartree
dipole: 1.7469 3.5577 0.4274
dipole: 3.9864
quadrupole: -83.9365 -88.1694 -97.2554
quadrupole: -5.6051 2.2896 -5.7462
quadrupole: 5.8506 1.6177 -7.4683 -5.6051 2.2896 -5.7462
hfenergy: -612.651818 hartree
pointgroup: C01 [X(C13H8Br1F1)]
dipole: -0.5786233 -1.3914797 0.4344878 debye
dipolederiv: -0.1997358 -0.0333281 0.0232205 -0.0327127 -0.6059966 0.2122401 0.050465 0.440562 -0.3503591 -0.4913084 -0.26437 -0.0942972 -0.4880774 -0.6802282 -0.1792368 -0.1211328 -0.1124797 -0.1782996 0.4357223 0.0272153 -0.0327209 -0.0061711 0.7522252 -0.3569817 -0.0630846 -0.5388526 0.5496222 -0.4890078 -0.0972939 0.002781 -0.0687334 -0.150122 -0.0013121 0.0243357 -0.013929 -0.1623355 -0.1884845 0.0766324 -0.0396063 0.1059547 -0.0696778 0.0137332 -0.0198933 0.0173372 -0.1245215 0.3422324 -0.1738515 -0.0007046 -0.0551062 0.1273861 -0.0025018 -0.0547543 0.0685938 0.0268863 0.1700669 0.1093 -0.0102207 -0.0552965 -0.0320581 -0.0049151 0.0370858 0.0321065 0.0064563 0.7147884 0.2764346 0.1036437 0.5639897 0.7847465 0.2353379 0.139377 0.1193313 0.1736435 0.0006791 -0.055487 0.014284 -0.1177077 0.1177541 0.0588035 -0.0286553 0.0034722 -0.103645 -0.2768786 0.2121819 -0.0208394 0.13724 -0.0389417 0.0486863 0.0284703 0.0123869 -0.1579711 -0.1654977 -0.1211335 0.0305998 0.0036037 0.0791233 0.0464435 -0.0057409 0.0280747 -0.1315463 -0.1363649 0.0599067 0.0201328 -0.0515368 -0.2070221 -0.0380312 -0.0065687 -0.0113735 -0.1822023 0.1598949 -0.1115425 0.024073 -0.0435187 0.0666657 0.0708834 -0.0051543 0.041377 -0.1147725 0.009487 -0.0134451 -0.0188023 -0.0875062 -0.0315565 0.0122649 -0.0177093 0.0113703 -0.1556427 0.0666637 0.113525 -0.0032825 0.1440288 -0.0351264 0.0498607 0.0265908 0.0218387 -0.1350418 0.0205916 -0.0082361 0.0014 0.0005496 -0.0347925 0.0217381 0.0061818 0.0575207 -0.0459376 0.0875152 0.0048771 -0.0027154 0.0484546 -0.0656978 -0.0374225 0.0124819 -0.0125732 0.1372872 0.0550854 -0.0933094 -0.01906 -0.0561116 -0.0380301 -0.0312821 -0.0038135 -0.0410184 0.1588307 0.0857999 0.0587281 0.0138338 0.0186616 -0.0803125 -0.0368272 -0.0031043 -0.0447736 0.149957 -0.0431062 -0.0087425 -0.0151177 -0.0119435 0.102283 -0.0133328 -0.0107029 -0.0140887 0.1786524 0.0100414 0.0898708 0.0113071 0.1045806 -0.0398416 -0.0296605 0.0123514 -0.0296961 0.1508941 -0.1114272 0.0495383 0.0230385 0.0615568 0.0728472 -0.0171781 0.0158281 -0.0138077 0.1577006 -0.0567571 -0.0974708 -0.0109474 -0.1141982 0.0063729 -0.0213098 -0.0128537 -0.0213788 0.1523449 unknown
polarizability: 219.7440694|-4.8580769|181.1955348|-3.274343|-6.4416938|77.2933181 unknown
InChI: InChI=1S/C13H8BrF/c14-13-10-5-2-1-4-8(10)9-6-3-7-11(15)12(9)13/h1-7,13H
charge 0 multiplicity 1
23 atoms
Br 0.152004 2.859933 -1.201951
F  3.074507 1.664852 0.497264
C  0.006455 1.453936 0.325666
C  1.048497 0.377606 0.166381
C  -1.302016 0.699973 0.218514
C  0.422788 -0.886185 -0.070124
C  -1.041924 -0.681258 -0.033487
C  2.443196 0.43407 0.237491
C  -2.617357 1.177475 0.335821
C  1.194988 -2.050498 -0.253824
C  -2.106714 -1.594214 -0.170786
C  3.243597 -0.710611 0.053125
C  2.607264 -1.949445 -0.196678
C  -3.687588 0.258402 0.200172
C  -3.433045 -1.112515 -0.052935
H  0.12228 2.097349 1.210148
H  -2.814035 2.240985 0.508251
H  0.719192 -3.02017 -0.430957
H  -1.919727 -2.656847 -0.360147
H  4.332513 -0.62651 0.107942
H  3.22345 -2.843071 -0.340346
H  -4.721138 0.610272 0.286867
H  -4.273885 -1.806829 -0.158307
