program: Gaussian 09
title: 000249693
version: EM64L-G09RevD.01
frameworkgroup: C1[X(C20H13F)]
method: RPBEPBE
basis: SDD
operation: Freq
keyword: #pfreq=noraman
keyword: PBEPBE/SDD
title: #p freq=noraman PBEPBE/SDD
converged: YES YES NO NO
title: Mulliken charges:
elementType: F C C C C C C C C C C C C C C C C C C C C H H H H H H H H H H H H H
charge: -0.198719 0.361353 0.013184 0.123360 0.166290 0.130869 -0.410048 -0.370526 -0.373782 -0.404612 -0.414675 -0.254482 -0.267754 -0.239028 -0.238795 0.236388 0.165303 -0.365925 -0.383135 -0.252740 -0.206474 0.247747 0.241944 0.275128 0.245620 0.248053 0.227754 0.227880 0.228170 0.228363 0.283959 0.256736 0.235255 0.237337
chargesum: 0.00000
title: Mulliken charges with hydrogens summed into heavy atoms:
elementType: F C C C C C C C C C C C C C C C C C C C C
charge: -0.198719 0.361353 0.013184 0.123360 0.166290 0.130869 -0.162301 -0.128582 -0.098653 -0.158992 -0.166622 -0.026728 -0.039875 -0.010857 -0.010432 0.236388 0.165303 -0.081966 -0.126400 -0.017485 0.030864
polarizability: 3.71065181e+02 1.24098263e+01 2.63030037e+02 -7.93722632e-01 2.45408905e+00 1.00097360e+02
1716.lowfreq: -5.9797 -1.4159 -0.0007 0.0004 0.0006 7.2109 34.9494 45.4417 63.1428
frequency: 34.9319 45.4384 63.1403 103.4473 136.1271 140.1580 166.9961 181.3007 225.7722 249.9457 273.0372 323.1912 400.2974 415.1448 427.8701 437.6397 447.0081 480.4556 488.2681 511.4152 540.1502 561.9334 567.6054 587.2789 616.7033 630.1900 656.2379 708.8553 728.7372 739.8714 752.5278 762.4979 767.3581 775.1179 782.0307 792.9527 842.2391 856.9460 871.9304 879.4015 888.7474 919.1743 947.2436 949.7711 961.5032 981.9275 984.6160 993.8465 995.9509 1024.4809 1032.2516 1035.0583 1070.8303 1087.1102 1112.4981 1141.9458 1166.1637 1170.3067 1176.1377 1177.5651 1204.5766 1231.3685 1246.5644 1287.0178 1296.9139 1304.4351 1345.5284 1375.7234 1391.7181 1402.6281 1437.4101 1438.9929 1444.0446 1466.8412 1467.3185 1483.7316 1571.9748 1582.9961 1589.8794 1610.3669 1613.0151 1614.6633 1642.2674 3100.0379 3122.9849 3125.4245 3130.6436 3137.5991 3139.8650 3143.5805 3154.3362 3156.4326 3162.5045 3167.8309 3172.6668 3180.5884
redmass: 6.1382 4.8390 5.3629 4.6983 3.8593 6.0649 5.2654 5.1852 5.3793 5.9528 4.2589 4.0839 3.7948 5.5258 3.4504 3.3325 5.1225 4.3624 4.9023 5.6452 3.6648 6.6055 3.3455 6.2515 6.9720 3.5535 6.1363 4.1206 4.6114 1.9022 1.6381 3.3279 1.4384 6.1395 1.9538 2.5264 3.6331 1.5410 1.5930 1.4877 1.5472 4.2729 1.4387 1.4325 1.3803 1.3356 1.3338 2.3630 2.0663 2.2879 2.1192 1.8980 3.4124 2.3961 1.7337 1.7461 1.1555 1.1150 1.8451 1.1289 2.1134 2.1188 2.0175 1.8556 1.5053 1.8653 2.1552 8.7935 2.8010 3.2755 2.3127 2.4442 2.8674 2.8610 2.7170 3.7730 6.2087 6.3321 6.6863 6.9164 7.2685 7.1893 8.4046 1.0868 1.0853 1.0855 1.0892 1.0906 1.0862 1.0944 1.0929 1.0940 1.1002 1.0964 1.0962 1.0995
irintensity: 0.2808 0.5904 1.0050 1.4291 0.1300 1.5867 0.3174 0.6551 0.4241 1.2449 0.4185 1.1919 2.2603 1.3899 3.8504 5.1683 1.9481 3.2939 5.4178 0.1619 0.3095 0.9063 0.1263 13.4006 3.3864 4.8205 0.8068 1.0365 1.0296 98.0664 2.7194 17.0024 58.3619 9.7780 96.5954 0.8153 3.6327 11.7973 6.0053 1.5627 0.4213 3.9364 5.4116 4.3765 1.2138 0.3082 0.1999 3.0978 0.5072 2.5884 7.9391 3.7061 6.6525 27.1662 3.7012 0.2049 0.4552 1.6045 23.5387 1.5221 6.6828 11.6250 4.1864 5.2628 9.3865 2.4377 6.3095 5.0301 3.8513 0.1362 44.6984 10.1817 43.0274 23.3361 1.8056 49.7772 9.3214 1.6165 0.5448 1.6089 10.9844 1.4716 9.7511 7.4272 3.0222 1.9459 2.5855 7.2215 2.3608 23.9635 27.4251 24.1863 44.6631 5.6470 15.2953 13.9708
temp: 298.150 k
press: 1.00000 atm
elementType: 9 6 6 6 6 6 6 6 6 6 6 6 6 6 6 6 6 6 6 6 6 1 1 1 1 1 1 1 1 1 1 1 1 1
symmnumber: 1
zpe: 686260.2 jmol-1
zpe.correction: 0.261383 hartree
zpe.thermalcorrener: 0.277030 hartree
zpe.thermalcorrenthalpy: 0.277975 hartree
zpe.thermalcorrgfe: 0.217720 hartree
zpe.sumelectzpe: -868.380657 hartree
zpe.sumelectthermal: -868.365010 hartree
zpe.sumelectthermalent: -868.364065 hartree
zpe.sumelectthermalfe: -868.424320 hartree
dipole: 0.7781 1.3976 1.1171
dipole: 1.9511
quadrupole: -97.4024 -109.8371 -127.7638
quadrupole: 4.6882 2.2409 -0.9768
quadrupole: 14.2654 1.8307 -16.0961 4.6882 2.2409 -0.9768
hfenergy: -868.6420401 hartree
pointgroup: C01 [X(C20H13F1)]
dipole: 0.399674 0.3943184 0.5234396 debye
polarizability: 371.9681254|-7.2822949|255.4146964|-1.6438612|32.3899483|106.8097568 unknown
InChI: InChI=1S/C20H13F/c21-20-12-6-1-7-14(20)13-19-17-10-4-2-8-15(17)16-9-3-5-11-18(16)19/h1-13H
charge 0 multiplicity 1
34 atoms
F  2.651062 -2.531755 -1.781121
C  -0.35079 -0.374457 -0.042707
C  -1.75419 -0.881891 -0.063668
C  -0.463944 1.106553 0.116881
C  -2.654918 0.21331 0.124869
C  -1.856259 1.449137 0.222948
C  0.736312 -1.206911 -0.193263
C  -2.252564 -2.193735 -0.197893
C  0.500989 2.138121 0.085392
C  -4.047061 0.002448 0.17668
C  -2.268759 2.790204 0.347203
C  -3.651858 -2.404497 -0.153865
C  0.082589 3.485854 0.199847
C  -4.541909 -1.316191 0.033361
C  -1.289025 3.811176 0.344128
C  2.170735 -0.941597 -0.010657
C  3.127663 -1.648122 -0.78599
C  2.703471 -0.091982 1.00438
C  4.515335 -1.522496 -0.635156
C  4.093479 0.052525 1.190179
C  5.00412 -0.653275 0.366591
H  0.512759 -2.244668 -0.476394
H  -1.579175 -3.047417 -0.334301
H  1.56283 1.915451 -0.045649
H  -4.740157 0.838077 0.323807
H  -3.331093 3.044918 0.430436
H  -4.052093 -3.418473 -0.263174
H  0.829824 4.286647 0.173322
H  -5.621453 -1.50031 0.068251
H  -1.592011 4.859895 0.439288
H  2.007459 0.422145 1.67376
H  5.185543 -2.092358 -1.285071
H  4.467957 0.705186 1.98556
H  6.083734 -0.539511 0.507721
