program: Gaussian 09
title: 000249692
version: EM64L-G09RevD.01
frameworkgroup: C1[X(C20H12Cl2)]
method: RPBEPBE
basis: SDD
operation: Freq
keyword: #p
keyword: freq=noraman
keyword: PBEPBE/SDD
title: #p freq=noraman PBEPBE/SDD
converged: YES YES NO NO
title: Mulliken charges:
elementType: Cl Cl C C C C C C C C C C C C C C C C C C C C H H H H H H H H H H H H
charge: -0.012111 -0.002283 0.361068 0.015901 0.128306 0.165221 0.131535 -0.452074 -0.371878 -0.376458 -0.402932 -0.413531 0.449928 -0.254308 -0.265997 -0.237798 -0.237803 -0.367571 -0.416579 -0.085174 -0.214150 -0.121137 0.233710 0.239399 0.274457 0.246873 0.249096 0.228778 0.229920 0.229731 0.230108 0.267350 0.288628 0.261776
chargesum: 0.00000
title: Mulliken charges with hydrogens summed into heavy atoms:
elementType: Cl Cl C C C C C C C C C C C C C C C C C C C C
charge: -0.012111 -0.002283 0.361068 0.015901 0.128306 0.165221 0.131535 -0.218364 -0.132480 -0.102001 -0.156059 -0.164436 0.449928 -0.025531 -0.036077 -0.008066 -0.007696 -0.100222 -0.127951 -0.085174 0.047626 -0.121137
polarizability: 4.40396904e+02 -1.07892265e+01 2.75063922e+02 -4.54699384e+00 -1.13637013e+00 1.09392665e+02
1716.lowfreq: -5.4311 -2.2770 0.0015 0.0019 0.0021 4.6641 24.0859 34.8472 44.5007
frequency: 24.0699 34.8452 44.4991 96.5728 119.4778 132.3143 150.4486 155.1658 165.0830 188.0186 232.4214 247.3357 278.7921 317.6935 359.0957 401.3456 414.6132 426.6185 427.5842 440.2853 458.2554 477.5526 509.8126 542.3962 565.8872 578.3538 616.4775 627.9841 630.0813 654.8831 691.0278 710.3992 726.0910 739.4538 752.7053 766.3306 781.7755 791.6115 825.8324 855.8205 868.8840 877.8614 887.5851 889.3596 926.0446 949.5611 952.3565 973.7559 984.8487 992.8871 995.6456 1001.0188 1025.1717 1035.0507 1076.7600 1112.5838 1120.4246 1141.6123 1150.4285 1170.1268 1177.4085 1201.5111 1229.7092 1243.6343 1270.5548 1288.1458 1304.6137 1329.6957 1369.4571 1383.4611 1391.8357 1403.2683 1437.9548 1444.8067 1459.1780 1467.2057 1480.1333 1550.3028 1583.1798 1587.9077 1590.1656 1611.8369 1613.1357 1640.2197 3081.9917 3123.2330 3126.9573 3131.3769 3139.1835 3144.5333 3154.5027 3155.7135 3157.9607 3163.4158 3171.6292 3177.9738
redmass: 7.6400 7.0629 7.8881 4.7400 5.3613 5.5520 5.5253 6.9179 5.5736 16.7805 5.1851 5.3977 4.7176 7.0987 5.4177 3.6900 6.2937 4.7748 3.7272 3.4533 4.2007 5.6191 5.2981 5.4609 3.3553 5.3429 6.9508 6.3995 3.6766 6.9836 4.2333 5.6544 4.7348 2.0056 1.5436 5.4281 1.8747 2.4423 1.3696 1.6428 3.8799 1.4090 1.5522 1.8547 3.5521 1.4305 1.4246 1.3495 1.3400 1.6543 3.4844 4.8587 2.2818 1.9317 3.0515 1.7430 2.2176 1.8083 1.4449 1.1333 1.1294 1.9108 1.9106 1.8498 1.9531 1.6060 1.8605 2.3686 5.0113 4.5798 2.2480 3.3645 2.2790 2.8267 2.7684 2.6949 4.1210 7.4300 6.3264 6.5041 6.6990 6.8581 7.3139 8.4809 1.0868 1.0857 1.0858 1.0889 1.0907 1.0943 1.0922 1.0922 1.0922 1.1002 1.0975 1.0970
irintensity: 0.1983 0.0352 0.0637 0.6142 0.4298 2.5576 0.3063 0.1811 0.1916 0.1900 0.5643 0.9690 0.0704 0.9816 3.4363 1.5131 0.3242 7.3042 3.2284 11.2854 8.5690 13.0838 0.4747 4.4929 0.0443 5.7863 4.3272 2.5851 5.2134 12.4382 6.8407 11.9323 9.1795 76.4290 3.3243 4.8422 91.4596 0.3261 19.5374 5.1439 26.3193 0.4243 9.0344 11.9015 16.6874 2.6042 4.0003 0.8570 0.0899 1.1184 3.3960 28.5820 2.6586 5.3547 4.5083 3.4615 72.7095 0.7682 2.2035 0.9375 0.1557 1.5466 20.1443 0.1074 8.6053 5.4228 2.2293 0.9556 3.9051 3.0868 17.2691 1.5352 33.0951 20.4027 106.2593 1.8335 66.1937 26.7309 1.6704 7.8900 0.5510 2.4576 11.9541 4.2738 10.8278 4.1747 2.6261 1.9049 7.0068 23.1249 1.1438 24.4097 13.9504 45.4023 12.4550 3.5619
temp: 298.150 k
press: 1.00000 atm
elementType: 17 17 6 6 6 6 6 6 6 6 6 6 6 6 6 6 6 6 6 6 6 6 1 1 1 1 1 1 1 1 1 1 1 1
symmnumber: 1
zpe: 657221.0 jmol-1
zpe.correction: 0.250322 hartree
zpe.thermalcorrener: 0.267685 hartree
zpe.thermalcorrenthalpy: 0.268630 hartree
zpe.thermalcorrgfe: 0.203440 hartree
zpe.sumelectzpe: -1687.984578 hartree
zpe.sumelectthermal: -1687.967214 hartree
zpe.sumelectthermalent: -1687.966270 hartree
zpe.sumelectthermalfe: -1688.031460 hartree
dipole: 2.9373 0.3443 -0.6066
dipole: 3.0190
quadrupole: -142.6646 -124.7512 -145.9107
quadrupole: -2.0612 1.4548 -0.2714
quadrupole: -4.8892 13.0243 -8.1352 -2.0612 1.4548 -0.2714
hfenergy: -1688.2348999 hartree
pointgroup: C01 [X(C20H12Cl2)]
dipole: -1.113935 -0.2789032 -0.3035533 debye
polarizability: 438.4900224|20.8558464|263.2268307|2.8724514|46.0552221|123.1366383 unknown
InChI: InChI=1S/C20H12Cl2/c21-19-10-9-13(12-20(19)22)11-18-16-7-3-1-5-14(16)15-6-2-4-8-17(15)18/h1-12H
charge 0 multiplicity 1
34 atoms
Cl 5.187019 2.466085 1.753395
Cl 6.327423 0.566827 -0.68792
C  -0.773796 0.406462 0.072856
C  -2.184275 0.888829 0.156083
C  -0.867771 -1.067723 -0.1510
C  -3.072107 -0.212261 -0.056339
C  -2.256977 -1.428573 -0.233318
C  0.303961 1.249254 0.235562
C  -2.699913 2.184581 0.36203
C  0.113396 -2.083444 -0.194864
C  -4.468247 -0.023992 -0.058799
C  -2.652353 -2.768985 -0.407266
C  1.7439 1.023661 0.01979
C  -4.103152 2.372536 0.367861
C  -0.287361 -3.431315 -0.359807
C  -4.980168 1.277967 0.158227
C  -1.657299 -3.772507 -0.479505
C  2.675939 1.715598 0.844584
C  2.25769 0.223318 -1.042011
C  4.061196 1.575077 0.647875
C  3.644296 0.096242 -1.24706
C  4.553215 0.761939 -0.395736
H  0.063056 2.272465 0.56022
H  -2.037817 3.044557 0.514182
H  1.175337 -1.850819 -0.083764
H  -5.151523 -0.864198 -0.223969
H  -3.712584 -3.037305 -0.471524
H  -4.516693 3.373544 0.532558
H  0.472627 -4.219648 -0.392015
H  -6.063038 1.444471 0.162676
H  -1.946664 -4.820586 -0.614527
H  2.31758 2.356394 1.656682
H  1.567589 -0.265942 -1.734744
H  4.031212 -0.50821 -2.072713
