program: Gaussian 09
title: 000249687
version: EM64L-G09RevD.01
frameworkgroup: C1[X(C13H6FNO3)]
method: RPBEPBE
basis: SDD
operation: Freq
keyword: #p
keyword: freq=noraman
keyword: PBEPBE/SDD
title: #p freq=noraman PBEPBE/SDD
converged: NO YES NO NO
title: Mulliken charges:
elementType: F O O O N C C C C C C C C C C C C C H H H H H H
charge: -0.187177 -0.131715 -0.205348 -0.196261 0.020979 0.302906 0.300844 0.227726 0.224552 -0.280685 -0.369323 -0.546080 -0.352961 -0.549406 0.410524 -0.370688 -0.363071 0.351054 0.257916 0.330771 0.256124 0.309586 0.293227 0.266506
chargesum: 0.00000
title: Mulliken charges with hydrogens summed into heavy atoms:
elementType: F O O O N C C C C C C C C C C C C C
charge: -0.187177 -0.131715 -0.205348 -0.196261 0.020979 0.302906 0.300844 0.227726 0.224552 -0.280685 -0.111407 -0.215309 -0.096837 -0.239819 0.410524 -0.077461 -0.096565 0.351054
polarizability: 3.06180200e+02 2.61732180e+00 1.73138783e+02 1.79442728e-03 -1.13696530e-02 5.72553991e+01
1716.lowfreq: -0.0012 -0.0005 0.0003 4.4341 6.4855 13.7955 48.6337 57.0645 112.7349
frequency: 48.6049 57.0629 112.7330 119.8179 151.7173 159.6958 210.0441 243.4588 262.9078 281.7170 366.3996 376.8297 409.8287 440.1383 447.2631 482.3290 495.6428 542.7230 552.3709 563.7026 614.9644 637.7051 665.1514 705.4690 706.5058 726.8245 772.4057 774.6667 823.7412 839.0221 868.6957 873.2916 913.1236 959.4252 968.5957 969.7400 996.0049 1006.0434 1054.2658 1080.3155 1118.1335 1131.3843 1164.2575 1190.8172 1207.7929 1231.8544 1258.6555 1280.6439 1357.8385 1373.8826 1395.3013 1438.4667 1440.9301 1455.5945 1486.8326 1597.4112 1598.0284 1603.3396 1618.6099 1639.8069 3148.1594 3152.0739 3174.5916 3179.4416 3180.6323 3183.8096
redmass: 12.5404 13.6392 6.0291 10.3961 7.2171 5.2540 10.7685 7.4261 12.1286 10.2075 5.7135 7.3122 3.3573 9.5683 3.4169 4.8366 8.8302 6.0530 6.3056 3.5657 8.2738 7.3434 5.6218 4.8477 8.9969 6.1444 10.3932 3.5628 3.7944 1.4159 1.5803 6.7985 1.5802 1.3954 3.9663 1.5805 1.3823 4.8608 2.0209 2.3022 1.8563 1.6244 2.3486 2.9329 8.0995 2.5833 1.4408 1.9361 7.6976 5.4438 6.1081 4.6469 2.7675 4.0149 5.6567 8.0403 8.3352 8.1314 7.8274 11.3061 1.0907 1.0909 1.0940 1.0959 1.0934 1.0949
irintensity: 0.8006 0.5138 0.5347 2.0031 0.9924 0.6846 1.1302 6.4461 1.0912 1.5431 0.3297 4.2832 1.4525 10.6608 0.4414 11.5657 1.5815 0.2863 10.3503 3.8436 0.9557 2.5527 2.9217 18.8051 40.1356 0.0026 0.7537 0.7093 30.2493 46.1693 18.2520 43.0016 13.9704 0.0840 2.1310 24.6763 0.3759 2.9713 43.9496 7.5498 16.1683 13.0222 20.0574 288.2277 266.8680 142.5968 26.8010 11.7977 83.4828 1.2293 29.6378 28.5702 9.3060 155.9377 2.0220 77.6143 118.7573 39.5451 41.7144 137.9362 1.2422 8.1653 1.9572 3.5008 6.3411 3.3407
temp: 298.150 k
press: 1.00000 atm
elementType: 9 8 8 8 7 6 6 6 6 6 6 6 6 6 6 6 6 6 1 1 1 1 1 1
symmnumber: 1
zpe: 418030.5 jmol-1
zpe.correction: 0.159219 hartree
zpe.thermalcorrener: 0.172566 hartree
zpe.thermalcorrenthalpy: 0.173510 hartree
zpe.thermalcorrgfe: 0.118530 hartree
zpe.sumelectzpe: -877.960280 hartree
zpe.sumelectthermal: -877.946934 hartree
zpe.sumelectthermalent: -877.945990 hartree
zpe.sumelectthermalfe: -878.000970 hartree
dipole: -4.1737 -4.9529 0.0050
dipole: 6.4770
quadrupole: -131.8108 -98.5836 -101.7485
quadrupole: 2.2637 0.0022 0.0111
quadrupole: -21.0965 12.1307 8.9658 2.2637 0.0022 0.0111
hfenergy: -878.1194999 hartree
pointgroup: C01 [X(C13H6F1N1O3)]
dipole: -1.6443267 1.9467076 -0.0019675 debye
dipolederiv: -1.4283407 -0.1542292 0.000743 -0.2615467 -0.2189473 0.0001552 0.0011898 0.0002431 -0.1441225 -0.4836886 0.0036144 0.0000473 -0.0616031 -0.9739782 -0.0014562 0.0001567 0.0016794 -0.284063 -0.9876192 -0.192221 -0.0003317 -0.3078353 -0.5777961 -0.0002242 -0.0000942 -0.0000068 -0.2265859 -0.7617921 0.1722651 -0.0002126 0.3572755 -0.6960602 0.0002102 -0.0001445 -0.0000913 -0.2215868 2.2752146 -0.0724088 0.0007847 -0.2170947 1.0598983 -0.0000218 0.0008732 0.0000869 0.186229 0.8878014 0.1386627 -0.0001534 0.0604765 0.1364238 0.0000469 -0.0012999 -0.0002833 0.0286751 -0.3005711 -0.1086662 0.0001243 -0.0386257 -0.0310142 0.0000534 0.0012408 -0.0002161 -0.0173053 -0.857289 -0.1222355 -0.0000617 0.1646734 -0.2633113 0.000185 -0.0005965 -0.0002033 0.0230036 -0.4191333 0.2934736 0.0000827 0.2941625 -0.1732477 0.0000763 0.0003705 -0.000354 0.0327855 1.2219047 -0.0199811 -0.0001441 0.1005832 1.1845535 0.0012552 0.0000072 -0.0004655 0.1216193 -0.686283 -0.2142539 -0.0001784 -0.2722159 0.0978472 -0.0000829 -0.000036 0.0000029 -0.1376638 0.4756216 -0.0535739 0.0001418 0.0965333 0.0064365 0.0001341 0.0000701 -0.000003 -0.0646711 0.0772091 0.0915791 0.0000517 -0.0589012 0.126737 -0.0000594 -0.0002987 0.0000909 -0.1221455 -0.2454844 -0.0836683 0.0000672 0.303998 0.0473334 -0.0000392 0.0001743 0.0001052 -0.1058431 -0.9927109 0.1055542 -0.0002084 0.1815664 -0.044691 0.0000345 -0.0005724 0.0000532 0.0425871 0.386394 0.100139 0.0002637 -0.3086884 -0.0205138 -0.0001339 0.0001474 0.0000432 -0.079995 -0.2037159 -0.0736821 -0.0001684 -0.3898988 -0.0733557 0.0001267 0.0000808 0.0000841 -0.1288558 1.5488487 0.1740937 -0.0009833 0.3347388 0.2138987 -0.0001814 -0.0014973 -0.0003156 0.0917392 0.059746 0.0738909 -0.0000173 0.0467478 -0.0383588 -0.0000011 0.0002465 -0.0000419 0.1515832 0.1366949 0.0117915 -0.0000214 0.0021488 0.0923491 -0.0000006 -0.0000019 -0.0001095 0.1719423 0.0853812 -0.0708656 0.0000358 -0.0297455 -0.0432313 0.0000023 -0.0001695 -0.0000474 0.153564 0.1036103 0.001378 0.000067 -0.042569 0.0487019 0.0000087 0.0001098 -0.0000876 0.1822693 0.090845 -0.0589783 -0.0000363 -0.0215542 0.0895619 -0.0000286 -0.0001986 -0.0000733 0.1683348 0.0173566 0.0583215 0.0001078 0.0673743 0.0507642 -0.0000591 0.0002426 -0.0000904 0.1785052 unknown
polarizability: 306.1861422|-2.4616496|173.1328403|-0.0017811|-0.0113717|57.2553991 unknown
InChI: InChI=1S/C13H6FNO3/c14-7-1-3-9-10-4-2-8(15(17)18)6-12(10)13(16)11(9)5-7/h1-6H
charge 0 multiplicity 1
24 atoms
F  -5.452834 -0.252089 0.002287
O  -0.566296 -2.807907 0.000959
O  5.112087 0.93714 0.00137
O  4.701286 -1.307869 0.001142
N  4.310743 -0.077039 0.001349
C  0.108771 0.73879 -0.001509
C  -1.374895 0.710399 -0.001307
C  0.58952 -0.608553 -0.001354
C  -1.800651 -0.653004 -0.00107
C  -0.588519 -1.549457 -0.003355
C  1.019231 1.813189 -0.000941
C  1.954812 -0.910275 -0.000242
C  -2.326466 1.748002 -0.000516
C  -3.156139 -1.011334 0.000306
C  2.850238 0.188236 0.000339
C  2.405591 1.531179 -0.00009
C  -3.70382 1.411124 0.000651
C  -4.081456 0.053169 0.001109
H  0.676647 2.852744 -0.000847
H  2.326429 -1.938366 -0.000202
H  -2.027311 2.801047 -0.000497
H  -3.482049 -2.055301 0.000376
H  3.151824 2.330177 0.000468
H  -4.480343 2.181499 0.001372
