program: Gaussian 09
title: 000249677
version: EM64L-G09RevD.01
frameworkgroup: C1[X(C20H12ClNO2)]
method: RPBEPBE
basis: SDD
operation: Freq
keyword: #p
keyword: freq=noraman
keyword: PBEPBE/SDD
title: #p freq=noraman PBEPBE/SDD
converged: YES YES NO NO
title: Mulliken charges:
elementType: Cl O O N C C C C C C C C C C C C C C C C C C C C H H H H H H H H H H H H
charge: -0.050806 -0.253597 -0.199491 -0.074663 0.263317 0.332243 0.193617 0.062775 -0.348326 -0.498386 -0.374619 0.255347 0.060109 -0.350350 -0.411777 -0.230576 -0.236815 0.507708 -0.344699 -0.284045 -0.360844 -0.230225 -0.228279 -0.214353 0.226197 0.282882 0.229349 0.277132 0.256189 0.234295 0.240064 0.249271 0.284097 0.260161 0.237515 0.239582
chargesum: 0.00000
title: Mulliken charges with hydrogens summed into heavy atoms:
elementType: Cl O O N C C C C C C C C C C C C C C C C C C C C
charge: -0.050806 -0.253597 -0.199491 -0.074663 0.263317 0.332243 0.193617 0.062775 -0.122129 -0.215505 -0.145270 0.255347 0.060109 -0.073218 -0.155587 0.003718 0.003249 0.507708 -0.095428 -0.284045 -0.076747 0.029936 0.009236 0.025229
polarizability: 5.54473626e+02 -9.47217322e+00 2.42598223e+02 -1.75970238e+01 -2.23384034e+00 1.07456282e+02
1716.lowfreq: -3.1333 -0.0018 -0.0017 -0.0010 1.4340 2.0242 16.7079 26.0979 36.6320
frequency: 16.6252 26.0898 36.6291 74.6391 83.8856 113.2280 126.1865 152.7205 159.4912 168.9441 218.9510 233.1081 250.8879 287.9102 309.0081 344.6759 362.1471 385.8809 410.1617 424.3232 425.9226 447.1244 459.7659 481.7381 494.6875 524.2659 528.7784 560.4005 603.5810 619.1460 638.2463 653.1659 663.0427 683.1499 692.9282 722.5702 730.4570 760.3072 768.0909 772.4076 785.3161 803.4060 830.4205 847.2599 879.7746 885.8938 889.7241 938.5655 959.9841 964.9191 975.3373 978.9648 994.0255 995.4393 1004.8245 1005.2798 1015.4002 1036.2825 1048.1549 1084.8736 1114.2550 1128.2439 1153.2563 1170.8397 1178.7747 1193.0431 1220.0151 1235.9880 1256.3183 1270.8004 1287.8838 1321.1202 1350.5434 1362.1613 1390.2946 1394.2218 1426.1190 1427.6140 1438.7280 1458.4271 1470.5748 1504.9936 1547.9713 1562.3830 1580.2270 1583.9357 1605.5511 1614.2852 1622.7208 1667.6878 3009.5283 3135.8240 3140.1867 3148.1695 3152.5104 3153.4860 3162.7747 3163.5695 3166.5872 3173.9616 3176.0542 3178.3367
redmass: 8.5622 6.6130 7.4147 5.2168 6.2187 4.9233 5.8795 6.2713 5.7294 5.3588 5.2410 6.3150 4.9413 4.2086 9.0304 5.6127 7.3227 7.1685 8.1850 4.7972 4.9688 3.1146 3.3035 8.5970 5.0878 4.0288 3.8005 7.4060 6.9320 5.9587 4.5490 6.9544 4.2723 7.1289 6.5976 3.3403 3.1370 6.5222 1.3163 2.9357 1.5057 8.4889 1.7125 3.2001 1.3629 1.7156 1.4920 5.4484 1.3945 1.4159 2.8222 1.3869 2.3412 3.5185 1.3461 1.4522 6.7625 2.0224 2.0618 2.6744 1.7957 1.5963 1.5966 1.0691 1.0994 2.5710 2.2167 2.2764 1.7064 1.5192 1.6760 2.1351 2.4584 4.1394 8.7462 2.9928 2.3474 5.0585 2.5126 2.5948 2.6783 3.7020 5.9514 6.3850 7.6717 6.2336 7.2475 6.4654 7.3083 12.0418 1.0876 1.0861 1.0861 1.0887 1.0888 1.0905 1.0941 1.0920 1.0958 1.1000 1.0970 1.0996
irintensity: 0.7381 1.0033 0.4481 0.3861 0.1517 1.3242 2.8640 0.7001 2.7829 4.0183 7.7522 2.7258 7.1959 10.2080 4.4413 4.9571 1.8100 3.0654 9.6690 1.8420 1.3172 7.9808 12.3507 0.1353 0.3345 2.3063 3.6242 12.4044 3.9951 16.8431 4.0188 4.2210 19.5163 17.3596 2.4202 7.0182 33.6829 6.2973 49.2441 31.3030 58.9162 6.3160 27.0609 14.1898 2.1084 31.2872 0.0016 25.9596 9.3672 16.4564 174.7223 3.7798 43.4354 12.0587 0.2122 5.4853 44.6459 6.5529 1.9668 59.8024 12.4410 12.5996 33.8216 3.6447 0.8298 2.9177 35.3815 21.1682 2.4721 31.3253 37.1828 28.1139 16.2647 36.3817 11.2519 13.9853 41.0529 13.9388 21.3161 5.9801 90.6756 3.4969 19.2881 38.8740 20.4159 236.7759 10.0460 50.2686 85.6357 361.4936 26.1032 6.2345 1.5704 9.3035 2.0095 4.5235 9.5625 0.9397 10.8115 21.8783 17.3366 21.6913
temp: 298.150 k
press: 1.00000 atm
elementType: 17 8 8 7 6 6 6 6 6 6 6 6 6 6 6 6 6 6 6 6 6 6 6 6 1 1 1 1 1 1 1 1 1 1 1 1
symmnumber: 1
zpe: 685694.0 jmol-1
zpe.correction: 0.261167 hartree
zpe.thermalcorrener: 0.280000 hartree
zpe.thermalcorrenthalpy: 0.280945 hartree
zpe.thermalcorrgfe: 0.211863 hartree
zpe.sumelectzpe: -1432.987658 hartree
zpe.sumelectthermal: -1432.968825 hartree
zpe.sumelectthermalent: -1432.967880 hartree
zpe.sumelectthermalfe: -1433.036962 hartree
dipole: 1.3683 -5.3410 1.0840
dipole: 5.6190
quadrupole: -100.0954 -148.1897 -149.9618
quadrupole: 12.9516 -10.6666 2.0966
quadrupole: 32.6536 -15.4407 -17.2129 12.9516 -10.6666 2.0966
hfenergy: -1433.2488249 hartree
pointgroup: C01 [X(C20H12Cl1N1O2)]
dipole: -0.6576298 1.9635215 -0.7741182 debye
polarizability: 554.0636111|18.8965075|205.7082271|15.279514|-60.0527274|144.7562929 unknown
InChI: InChI=1S/C20H12ClNO2/c21-18-8-4-1-5-13(18)12-22-14-9-10-16-15-6-2-3-7-17(15)20(23)24-19(16)11-14/h1-12H
charge 0 multiplicity 1
36 atoms
Cl -4.60786 -1.691442 2.375651
O  2.04411 -1.652639 0.518161
O  3.930736 -2.847864 1.016159
N  -2.126832 0.644818 -0.516223
C  2.144763 0.723413 -0.174951
C  3.607815 0.690866 -0.060459
C  1.409262 -0.458682 0.12263
C  4.243601 -0.526065 0.347908
C  1.390991 1.861016 -0.586112
C  0.007604 -0.522997 0.039937
C  4.435454 1.816385 -0.335016
C  -0.720255 0.627124 -0.361209
C  3.46802 -1.749334 0.654272
C  5.655848 -0.601216 0.47288
C  -0.003926 1.816338 -0.694352
C  5.832869 1.733646 -0.208948
C  6.452366 0.521941 0.196585
C  -4.367119 -0.092207 0.051135
C  -2.913564 -0.038512 0.280411
C  -5.250616 -0.800256 0.90936
C  -4.944665 0.577719 -1.06837
C  -6.638518 -0.854753 0.684305
C  -6.328413 0.537219 -1.310567
C  -7.179288 -0.180769 -0.433543
H  1.908576 2.791948 -0.836123
H  -0.487828 -1.474303 0.256427
H  3.985715 2.76318 -0.648407
H  6.095957 -1.552645 0.787876
H  -0.574625 2.687636 -1.027741
H  6.448421 2.613581 -0.425793
H  7.541287 0.465195 0.292896
H  -2.533027 -0.582921 1.165226
H  -4.259447 1.122001 -1.726115
H  -7.282576 -1.41344 1.368976
H  -6.748723 1.05908 -2.176359
H  -8.258612 -0.219361 -0.614506
