program: Gaussian 09
title: 000249676
version: EM64L-G09RevD.01
frameworkgroup: C1[X(C15H11NO3)]
method: RPBEPBE
basis: SDD
operation: Freq
keyword: #p
keyword: freq=noraman
keyword: PBEPBE/SDD
title: #p freq=noraman PBEPBE/SDD
converged: NO YES NO YES
title: Mulliken charges:
elementType: O O O N C C C C C C C C C C C C C C C H H H H H H H H H H H
charge: -0.248514 -0.198960 -0.243192 -0.447081 0.279597 0.328654 0.198520 0.062553 -0.356790 -0.509469 0.537863 -0.372230 -0.522014 0.059367 -0.349519 -0.230741 -0.238613 0.219153 -0.798843 0.225258 0.342532 0.225973 0.223072 0.276900 0.232835 0.239368 0.314778 0.238154 0.273230 0.238160
chargesum: 0.00000
title: Mulliken charges with hydrogens summed into heavy atoms:
elementType: O O O N C C C C C C C C C C C C C C C
charge: -0.248514 -0.198960 -0.243192 -0.132303 0.279597 0.328654 0.198520 0.062553 -0.131532 -0.166936 0.537863 -0.146258 -0.298942 0.059367 -0.072618 0.002094 0.000755 0.219153 -0.049299
polarizability: 3.35990418e+02 2.34789508e+00 1.92357973e+02 7.38923799e-04 6.40419940e-05 7.31434766e+01
1716.lowfreq: -70.2172 -5.8556 -2.2595 -0.0011 0.0004 0.0009 2.4236 37.5827 59.5110
frequency: -70.2062 37.5724 59.5034 90.1041 100.5379 101.1490 139.8721 200.9486 210.9497 257.0205 267.6039 306.0777 341.2220 366.3777 420.4086 425.1917 431.5959 451.6383 483.1596 523.7810 543.5758 573.8116 601.6466 631.0464 639.9359 643.2974 649.8942 663.4475 693.4251 728.5542 762.5736 770.1854 784.6791 804.9798 815.5871 887.8327 923.8949 929.1354 936.6424 940.2939 965.4443 977.8120 994.7804 1004.1018 1007.1607 1032.6474 1047.9830 1091.5436 1139.2861 1162.7762 1178.5583 1208.0058 1229.2365 1242.6051 1270.6246 1275.8397 1324.1346 1374.9421 1377.1044 1392.0494 1426.0950 1442.4634 1449.8272 1465.6713 1468.0998 1499.4516 1519.9037 1565.2447 1588.8360 1615.7846 1627.0619 1637.9210 1669.5787 2988.5149 3073.4804 3122.6795 3134.4962 3140.2978 3148.8422 3158.0301 3163.2991 3173.6233 3203.1195 3523.3840
redmass: 1.0408 6.1064 4.9095 6.0606 4.1970 5.6412 5.0615 6.7574 5.2298 6.1020 4.2631 7.5852 4.3895 7.0880 5.7869 3.5817 6.0096 3.0587 8.8913 3.7306 4.9430 3.1025 7.0807 2.4998 5.8909 1.3689 7.7172 4.2700 6.4263 3.0821 5.9036 3.2389 1.5287 7.2329 1.7005 1.4960 5.9079 1.4255 4.7341 1.3671 2.9135 1.3806 6.7714 1.3438 2.0470 1.6678 2.0497 2.7459 1.9208 1.5648 1.0825 2.3551 2.8561 1.8517 1.7386 1.7821 2.3490 2.5737 1.4421 9.1220 4.7543 1.8434 1.5848 2.1564 1.0466 2.1205 3.8569 5.3405 7.0065 6.3740 5.6632 6.0134 11.7699 1.0384 1.0983 1.0888 1.0860 1.0978 1.0898 1.0952 1.0934 1.1004 1.0933 1.0765
irintensity: 0.0661 0.0129 8.1372 1.5176 0.6711 2.4351 0.2048 2.0543 0.0041 0.0141 1.9727 8.3659 0.0012 0.3835 2.9952 0.2377 0.4317 9.9617 0.3186 4.7527 8.4995 1.9123 2.5718 29.3283 13.3617 43.3310 2.6071 14.4113 0.1495 22.8365 0.6875 27.9962 59.3521 8.8575 36.8800 0.1710 7.2166 40.8912 77.8664 0.9039 59.5480 1.9601 30.7291 0.2032 89.7800 8.1935 1.8577 51.6637 39.8725 0.5555 1.7241 35.0791 116.9531 105.1968 17.3173 1.4671 53.0518 97.0447 96.3473 41.9510 71.8092 150.2150 17.9307 30.0974 20.5381 425.0729 26.6866 98.0515 46.7649 61.7530 214.5564 194.3986 299.9243 8.0616 14.2905 18.4195 3.7204 6.2743 5.2143 1.2353 21.8225 25.7925 17.4348 15.9440
temp: 298.150 k
press: 1.00000 atm
elementType: 8 8 8 7 6 6 6 6 6 6 6 6 6 6 6 6 6 6 6 1 1 1 1 1 1 1 1 1 1 1
symmnumber: 1
zpe: 587614.6 jmol-1
zpe.correction: 0.223811 hartree
zpe.thermalcorrener: 0.238521 hartree
zpe.thermalcorrenthalpy: 0.239465 hartree
zpe.thermalcorrgfe: 0.181426 hartree
zpe.sumelectzpe: -857.355182 hartree
zpe.sumelectthermal: -857.340472 hartree
zpe.sumelectthermalent: -857.339528 hartree
zpe.sumelectthermalfe: -857.397566 hartree
dipole: -1.6520 -8.8379 -0.0001
dipole: 8.9910
quadrupole: -77.4128 -115.7423 -113.0006
quadrupole: 6.3025 0.0003 -0.0004
quadrupole: 24.6391 -13.6904 -10.9487 6.3025 0.0003 -0.0004
hfenergy: -857.5789924 hartree
pointgroup: C01 [X(C15H11N1O3)]
dipole: -0.6308128 -3.4806096 -0.0043894 debye
polarizability: 335.9602728|3.1370992|192.3879257|-0.0180416|0.1505864|73.1436686 unknown
InChI: InChI=1S/C15H11NO3/c1-9(17)16-10-6-7-12-11-4-2-3-5-13(11)15(18)19-14(12)8-10/h2-8,16H,1H3
charge 0 multiplicity 1
30 atoms
O  0.388855 1.749862 0.002584
O  2.275005 3.047168 0.004106
O  -4.376974 1.519853 0.002787
N  -3.779844 -0.751284 -0.000206
C  0.505284 -0.720342 -0.000552
C  1.970839 -0.651695 -0.000576
C  -0.240985 0.491573 0.001049
C  2.602272 0.633415 0.000986
C  -0.247257 -1.927848 -0.002013
C  -1.647977 0.535452 0.001239
C  -2.36327 -0.683664 -0.000243
C  2.806386 -1.8045 -0.002071
C  -1.646509 -1.91884 -0.001874
C  1.818513 1.888156 0.00261
C  4.017606 0.74797 0.001032
C  4.206411 -1.682952 -0.002019
C  4.821726 -0.403004 -0.000466
C  -4.708398 0.300805 0.001204
C  -6.163929 -0.166764 0.000781
H  0.270107 -2.891805 -0.003291
H  -2.167098 1.49438 0.002518
H  2.360572 -2.803831 -0.003281
H  -2.196121 -2.86821 -0.003037
H  4.453177 1.75224 0.002262
H  4.827466 -2.585516 -0.003185
H  5.91284 -0.315741 -0.000437
H  -4.173364 -1.695627 -0.001367
H  -6.390141 -0.773493 -0.895754
H  -6.814746 0.718649 0.001949
H  -6.389947 -0.775705 0.895865
