program: Gaussian 09
title: 000249675
version: EM64L-G09RevD.01
frameworkgroup: C1[X(C15H8F3NO3)]
method: RPBEPBE
basis: SDD
operation: Freq
keyword: #p
keyword: freq=noraman
keyword: PBEPBE/SDD
title: #p freq=noraman PBEPBE/SDD
converged: NO NO NO NO
title: Mulliken charges:
elementType: F F F O O O N C C C C C C C C C C C C C C C H H H H H H H H
charge: -0.180409 -0.135082 -0.135056 -0.247986 -0.189523 -0.188658 -0.458170 0.281225 0.331593 0.196387 0.065011 -0.351942 -0.491200 0.557260 -0.368283 -0.520093 0.062001 -0.346858 -0.229350 -0.234630 0.143204 0.299086 0.230172 0.336598 0.233391 0.227663 0.278928 0.236578 0.242899 0.355244
chargesum: 0.00000
title: Mulliken charges with hydrogens summed into heavy atoms:
elementType: F F F O O O N C C C C C C C C C C C C C C C
charge: -0.180409 -0.135082 -0.135056 -0.247986 -0.189523 -0.188658 -0.102926 0.281225 0.331593 0.196387 0.065011 -0.121770 -0.154602 0.557260 -0.140620 -0.286702 0.062001 -0.067931 0.007228 0.008269 0.143204 0.299086
polarizability: 3.43749979e+02 -5.97799951e+00 1.94551363e+02 1.09771703e-02 1.68511604e-04 7.52274162e+01
1716.lowfreq: -3.8318 -3.3896 -0.0010 -0.0006 0.0003 5.4883 26.0538 32.1942 42.3150
frequency: 25.7361 32.1694 42.3019 70.9671 86.6853 97.8245 136.5649 166.5241 186.4903 202.8880 234.5544 278.2105 280.0861 303.9090 352.5605 358.2302 387.8979 401.8350 424.7088 429.1046 439.1597 452.4336 484.5870 502.0150 524.3882 582.9701 602.3703 624.7110 640.7747 650.0236 662.6799 690.2763 694.7349 714.5516 730.0686 754.2094 771.4607 786.2958 797.4816 822.5040 845.8913 890.3605 923.6586 932.8705 946.6537 979.5123 981.0726 994.6578 1006.7283 1015.5064 1031.9494 1048.4458 1079.6102 1094.7279 1145.3294 1167.9534 1180.2209 1209.4367 1226.5184 1245.6693 1272.7610 1282.3330 1323.5640 1382.1815 1393.7296 1426.7679 1448.0135 1467.5440 1517.9560 1519.8490 1570.3039 1594.3008 1614.7853 1627.6489 1646.0794 1675.0708 3130.6969 3137.5398 3151.0135 3160.5859 3167.1389 3175.4275 3201.9160 3503.7443
redmass: 13.2841 8.7931 10.9555 9.9418 6.0364 5.2997 5.6382 13.1545 7.5021 6.4280 8.0980 7.5033 12.4034 9.0150 4.7682 8.9887 10.9579 8.0018 3.6513 7.6516 11.3458 3.2533 9.0795 13.4126 3.7613 8.7225 7.1382 3.7683 11.7178 8.1295 4.2987 6.5741 2.6219 1.9477 2.6945 7.0865 3.3435 1.5143 8.6896 1.6544 8.3422 1.4910 1.4363 7.1218 1.3832 1.3815 4.5974 7.2314 1.3485 9.1950 12.7154 2.0669 4.4643 2.9285 1.8877 1.7554 1.0830 2.7098 3.2095 1.8131 1.8655 1.7522 2.3211 3.9585 8.2963 5.2092 2.9342 2.3981 3.4853 2.3488 4.8036 5.3862 6.3070 6.1182 9.4274 12.0945 1.0891 1.0862 1.0898 1.0954 1.0938 1.1005 1.0934 1.0766
irintensity: 0.1218 0.0082 0.3343 0.3247 0.0006 5.6461 0.4079 3.9733 0.8743 1.6077 1.1565 0.2160 0.9915 13.1498 0.0301 0.8840 2.2978 4.4826 0.7506 2.2115 9.3298 4.8741 0.4042 9.1611 3.6507 15.2920 1.4571 13.1045 22.0442 2.8750 20.1723 1.4597 4.3982 54.9743 9.1086 3.3467 24.8869 66.5329 27.2841 45.5015 46.5978 0.1387 35.7158 98.0442 0.1405 1.7711 162.8758 22.4708 0.1615 134.7538 258.7101 3.0455 185.0473 124.9624 76.8555 82.7073 1.4782 1.2305 38.0922 22.6044 6.5940 8.3545 22.2987 58.4241 12.2638 32.5376 52.1427 28.8927 0.5083 250.7308 80.6393 64.6458 49.7452 146.2727 297.6923 352.3991 12.6276 2.5449 5.1223 2.7204 14.4717 23.8617 12.7183 62.6614
temp: 298.150 k
press: 1.00000 atm
elementType: 9 9 9 8 8 8 7 6 6 6 6 6 6 6 6 6 6 6 6 6 6 6 1 1 1 1 1 1 1 1
symmnumber: 1
zpe: 524949.3 jmol-1
zpe.correction: 0.199943 hartree
zpe.thermalcorrener: 0.217519 hartree
zpe.thermalcorrenthalpy: 0.218463 hartree
zpe.thermalcorrgfe: 0.152662 hartree
zpe.sumelectzpe: -1154.856046 hartree
zpe.sumelectthermal: -1154.838469 hartree
zpe.sumelectthermalent: -1154.837525 hartree
zpe.sumelectthermalfe: -1154.903327 hartree
dipole: 3.4448 -8.2589 -0.0008
dipole: 8.9485
quadrupole: -121.3094 -129.0155 -127.6426
quadrupole: -6.2070 0.0058 0.0010
quadrupole: 4.6798 -3.0263 -1.6535 -6.2070 0.0058 0.0010
hfenergy: -1155.0559885 hartree
pointgroup: C01 [X(C15H8F3N1O3)]
dipole: 1.3842934 -3.2370507 0.0004366 debye
polarizability: 343.8450033|-4.6421929|194.4563322|0.0082868|-0.0285072|75.2274228 unknown
InChI: InChI=1S/C15H8F3NO3/c16-15(17,18)14(21)19-8-5-6-10-9-3-1-2-4-11(9)13(20)22-12(10)7-8/h1-7,19H
charge 0 multiplicity 1
30 atoms
F  -5.411363 -1.479554 -0.000164
F  -5.938125 0.421989 1.134529
F  -5.939329 0.422648 -1.13318
O  1.305668 1.768132 -0.000589
O  3.211829 3.037548 -0.000881
O  -3.496212 1.618537 -0.000516
N  -2.893959 -0.674322 -0.000217
C  1.386244 -0.703397 0.000032
C  2.854024 -0.657092 0.000093
C  0.660978 0.521348 -0.000316
C  3.504158 0.618311 -0.000192
C  0.617973 -1.9007 0.00028
C  -0.74603 0.583614 -0.000415
C  -1.472258 -0.626626 -0.000153
C  3.669841 -1.822907 0.000413
C  -0.781335 -1.873239 0.000195
C  2.741241 1.886202 -0.000517
C  4.920881 0.710824 -0.000166
C  5.071936 -1.723375 0.000443
C  5.706353 -0.453264 0.000152
C  -3.769715 0.391767 -0.000506
C  -5.262044 -0.056061 0.000152
H  1.121973 -2.871322 0.000548
H  -1.244033 1.554201 -0.000703
H  -1.345101 -2.813643 0.000398
H  3.20907 -2.815353 0.000638
H  5.373227 1.707543 -0.000394
H  5.678789 -2.635286 0.000691
H  6.79859 -0.382958 0.000177
H  -3.313873 -1.609663 -0.000035
