program: Gaussian 09
title: 000019793
version: EM64L-G09RevD.01
frameworkgroup: C1[X(C18H20)]
method: RPBEPBE
basis: SDD
operation: Freq
keyword: #p
keyword: freq=noraman
keyword: PBEPBE/SDD
title: #p freq=noraman PBEPBE/SDD
converged: YES YES NO NO
title: Mulliken charges:
elementType: C C C C C C C C C C C C C C C C C C H H H H H H H H H H H H H H H H H H H H
charge: 0.077699 0.175195 -0.597310 0.237309 0.313342 0.449076 -0.770387 -0.754677 -0.737151 -0.421734 -0.441564 -0.403456 -0.404125 -0.256203 -0.244705 -0.245423 -0.253937 -0.246149 0.220701 0.223415 0.223142 0.222839 0.218868 0.220660 0.216294 0.208430 0.252954 0.209744 0.211294 0.246518 0.238834 0.259692 0.230798 0.224646 0.222578 0.223812 0.222189 0.226791
chargesum: 0.00000
title: Mulliken charges with hydrogens summed into heavy atoms:
elementType: C C C C C C C C C C C C C C C C C C
charge: 0.077699 0.175195 -0.153194 0.237309 0.313342 0.449076 -0.105538 -0.109293 -0.063160 -0.175216 -0.202730 -0.143764 -0.173326 -0.031557 -0.022127 -0.021611 -0.031748 -0.019357
polarizability: 2.17946491e+02 1.20609837e+01 1.82005779e+02 5.33478039e+00 9.09003132e+00 1.48106397e+02
1716.lowfreq: 0.0008 0.0009 0.0009 3.8218 9.1158 11.5233 51.8549 54.9481 68.9251
frequency: 51.8005 54.9069 68.8460 117.1365 133.7770 180.7366 211.5741 221.9411 233.9888 249.1696 254.6310 263.0297 274.1372 302.4478 325.4650 346.3923 389.0377 405.6352 439.5660 488.2522 524.3099 530.7642 538.7590 573.9196 586.3209 610.0673 617.8292 701.1053 708.6563 719.8316 766.2704 771.6327 773.2595 801.4728 854.1537 855.1440 881.1549 907.9928 922.1648 927.7420 940.9924 951.7296 964.0669 979.3490 985.9118 990.1748 995.7750 1005.4499 1023.3344 1025.8798 1040.3571 1058.4068 1079.5772 1102.6637 1104.9172 1126.5305 1139.1440 1170.0749 1172.1589 1174.4386 1195.8453 1205.7963 1207.8426 1271.8332 1272.8439 1282.1682 1313.4195 1321.6086 1374.4809 1376.7137 1383.7885 1388.2489 1395.4844 1432.4738 1441.7514 1460.5318 1463.5671 1466.3275 1468.9840 1473.1756 1476.7826 1481.3013 1484.7565 1485.3678 1587.2523 1593.3068 1608.8024 1612.5960 2969.2800 2973.2336 2977.8358 2991.4580 3059.3700 3063.9418 3067.2807 3073.1719 3075.8545 3079.0766 3086.9009 3114.5922 3115.8958 3122.3719 3124.0811 3136.5027 3137.0651 3149.9913 3156.8198 3162.5596
redmass: 3.6249 4.0375 4.0493 3.4971 2.9693 2.9108 1.3000 1.7681 1.2619 1.1455 2.3958 4.0552 2.5307 2.7594 2.9167 2.8875 2.1770 2.8490 3.8348 3.4106 3.5757 3.4170 3.0659 3.5340 3.7715 4.1133 6.3707 5.2009 1.6666 4.7503 1.3940 2.0818 3.2259 2.6023 1.4288 2.0474 1.4050 2.1731 1.4976 1.6624 1.4209 1.4119 1.8710 1.3810 1.3157 5.9218 1.3206 1.3610 2.4656 2.5279 2.9448 1.5915 1.8334 2.0216 1.9909 2.0132 2.2016 1.3735 1.0545 1.3983 1.1277 2.6461 3.0098 2.3742 2.0736 1.6971 1.5988 1.4121 5.6922 1.2115 8.1560 1.2114 1.2050 2.2402 2.2478 1.0844 1.0781 1.5928 1.0617 1.2520 1.3746 1.0568 1.3869 1.2598 6.0136 7.1901 6.1388 6.5753 1.0352 1.0359 1.0350 1.0629 1.0998 1.1001 1.0987 1.0999 1.0993 1.1003 1.0993 1.0855 1.0851 1.0889 1.0868 1.0936 1.0931 1.0943 1.1001 1.1007
irintensity: 0.0246 0.0722 0.0296 0.6049 0.7898 0.5709 0.0699 0.0180 0.1731 0.0682 0.3877 0.2392 0.1682 0.4967 0.1970 0.4369 0.3261 0.0329 1.0021 3.8212 2.8691 4.5821 10.4888 3.9522 4.6733 4.5972 0.2263 0.2953 52.7685 0.3072 57.0460 38.1786 9.9499 8.1779 1.0279 1.8766 0.0971 1.0145 1.6046 0.7767 1.4185 2.5969 3.0377 0.1507 0.0184 0.3288 0.1535 0.3132 11.7394 16.6323 4.6357 3.1173 9.3431 4.4736 3.8679 2.6643 1.8738 0.5054 0.3125 1.5887 1.8948 2.8439 8.6826 6.3326 8.1802 1.3266 11.1856 1.1990 3.6228 12.3664 5.8564 10.6183 11.8973 9.9316 7.7017 1.0802 2.5559 4.0963 2.8753 2.4716 17.3206 8.9917 21.6630 31.0351 1.2831 0.8871 13.1796 2.4596 26.7858 43.5951 25.4000 39.1762 4.3743 6.3627 64.2045 43.2122 23.2794 53.1560 26.9242 7.3091 5.9271 4.0439 1.2449 34.1109 30.1852 23.8744 38.9566 23.6400
temp: 298.150 k
press: 1.00000 atm
elementType: 6 6 6 6 6 6 6 6 6 6 6 6 6 6 6 6 6 6 1 1 1 1 1 1 1 1 1 1 1 1 1 1 1 1 1 1 1 1
symmnumber: 1
zpe: 848034.4 jmol-1
zpe.correction: 0.322999 hartree
zpe.thermalcorrener: 0.339127 hartree
zpe.thermalcorrenthalpy: 0.340071 hartree
zpe.thermalcorrgfe: 0.280562 hartree
zpe.sumelectzpe: -696.630936 hartree
zpe.sumelectthermal: -696.614809 hartree
zpe.sumelectthermalent: -696.613865 hartree
zpe.sumelectthermalfe: -696.673373 hartree
dipole: -0.0493 0.4657 0.1191
dipole: 0.4832
quadrupole: -103.1725 -102.5874 -107.4438
quadrupole: 1.8890 1.9275 2.4930
quadrupole: 1.2287 1.8138 -3.0425 1.8890 1.9275 2.4930
hfenergy: -696.9539357 hartree
pointgroup: C01 [X(C18H20)]
dipole: 0.0114889 0.1822466 -0.0528416 debye
polarizability: 218.7997715|-9.9380348|180.3087554|7.2216151|-10.07048|148.9501409 unknown
InChI: InChI=1S/C18H20/c1-17(2)13-18(3,14-9-5-4-6-10-14)16-12-8-7-11-15(16)17/h4-12H,13H2,1-3H3
charge 0 multiplicity 1
38 atoms
C  -0.212727 0.180323 -1.094854
C  1.253842 1.74867 0.263585
C  0.237245 1.684132 -0.929195
C  0.995802 -0.554707 -0.497807
C  1.814384 0.320392 0.25862
C  -1.533399 -0.107858 -0.332666
C  -0.41253 -0.180436 -2.595316
C  2.34475 2.820394 0.020347
C  0.534275 2.04142 1.613135
C  1.338157 -1.91728 -0.626783
C  2.973198 -0.16311 0.900963
C  -1.632902 -1.074443 0.699623
C  -2.709743 0.608148 -0.687552
C  2.506015 -2.403557 0.009442
C  3.318239 -1.53058 0.77338
C  -2.862683 -1.317792 1.355507
C  -3.938214 0.369803 -0.036033
C  -4.022042 -0.59821 0.992496
H  0.758651 1.993401 -1.856412
H  -0.617357 2.366615 -0.778894
H  0.527224 -0.026004 -3.155796
H  -0.719922 -1.235253 -2.714781
H  -1.196457 0.447742 -3.055091
H  2.911356 2.611932 -0.905609
H  1.887492 3.823573 -0.072327
H  3.063973 2.859057 0.860071
H  -0.278978 1.319541 1.800543
H  1.247024 1.98278 2.456883
H  0.09774 3.058183 1.603426
H  0.713477 -2.596723 -1.218894
H  3.611002 0.510389 1.485989
H  -0.7441 -1.638632 0.999807
H  -2.667788 1.363838 -1.481623
H  2.784303 -3.458884 -0.090498
H  4.220842 -1.915333 1.262029
H  -2.910819 -2.069047 2.152409
H  -4.828973 0.937347 -0.329517
H  -4.974359 -0.785727 1.501092
