program: Gaussian 09
title: 000249663
version: EM64L-G09RevD.01
frameworkgroup: C1[X(C15H11BrClNO)]
method: RPBEPBE
basis: SDD
operation: Freq
keyword: #p
keyword: freq=noraman
keyword: PBEPBE/SDD
title: #p freq=noraman PBEPBE/SDD
converged: YES YES NO NO
title: Mulliken charges:
elementType: Br Cl O N C C C C C C C C C C C C C C C H H H H H H H H H H H
charge: -0.018431 -0.062008 -0.250651 -0.445802 -0.821542 0.389317 0.229416 0.346073 0.190511 -0.523040 -0.431143 -0.384736 0.680623 -0.386358 -0.433026 -0.235771 -0.225740 0.219445 -0.796872 0.325989 0.335099 0.268362 0.255701 0.241730 0.232073 0.230481 0.318639 0.242053 0.269654 0.239954
chargesum: 0.00000
title: Mulliken charges with hydrogens summed into heavy atoms:
elementType: Br Cl O N C C C C C C C C C C C C C C C
charge: -0.018431 -0.062008 -0.250651 -0.127163 -0.495553 0.389317 0.229416 0.346073 0.190511 -0.187941 -0.162781 -0.129035 0.680623 -0.144628 -0.433026 -0.003698 0.004741 0.219445 -0.045211
polarizability: 3.31635511e+02 -1.63791406e+01 2.30573890e+02 -8.66505105e+00 -8.45127857e+00 9.74412570e+01
1716.lowfreq: -79.5854 -5.9947 -4.5566 -1.6817 0.0018 0.0020 0.0021 29.3433 54.0443
frequency: -79.5825 29.3404 54.0406 65.9890 76.2155 89.6817 111.8469 126.4811 156.2433 187.0904 224.6924 241.9230 257.6552 280.7757 324.5678 373.8155 401.3946 430.4564 443.6741 472.3282 481.6403 528.5063 575.9750 578.3525 588.6328 609.2662 640.5766 671.5346 676.3089 707.5856 745.1206 755.1446 766.5404 774.8339 788.8448 842.7735 874.3163 884.4268 925.8621 946.7408 954.1617 956.5650 990.2313 1003.2831 1007.2777 1028.2705 1032.3983 1099.2390 1121.1155 1140.1578 1168.1756 1173.6423 1197.5254 1208.1463 1231.4003 1241.1204 1289.2396 1314.8012 1355.2047 1378.1634 1386.6378 1435.9053 1440.7889 1448.8559 1454.9883 1466.2495 1487.7194 1503.8397 1584.6319 1594.6265 1618.2535 1623.3811 1635.8066 2989.7607 3074.7676 3081.3572 3128.1964 3137.6971 3137.7258 3149.0280 3166.3317 3166.7652 3180.8024 3483.3759
redmass: 1.0333 9.0190 7.7776 6.8296 6.5457 5.5373 5.1396 6.2158 7.5876 6.7281 7.9991 4.8585 7.8439 4.5097 9.2597 5.1887 5.9470 3.8119 3.2460 4.9096 4.5300 5.1689 4.8348 3.1998 6.2386 4.2269 5.9179 3.1365 3.1404 1.8807 2.1711 5.1210 3.9148 2.1334 3.5230 4.4266 1.4377 1.5727 4.2413 2.0851 1.4168 1.8285 1.3408 2.5677 3.1264 2.2416 1.6668 2.0376 1.1836 1.6904 1.5780 1.2584 1.8453 3.4409 2.2170 1.4939 1.7398 2.7231 5.0974 1.2465 4.5508 3.5099 2.3072 1.7476 1.9923 1.0465 4.6846 2.0887 6.5739 6.5273 7.3322 7.6616 4.9934 1.0384 1.0982 1.0875 1.0859 1.0897 1.0980 1.0951 1.0974 1.0959 1.0936 1.0764
irintensity: 0.1062 0.0351 2.3982 9.1214 0.1394 0.4972 2.6145 3.2296 1.7872 1.2881 0.5816 0.5298 2.4998 1.0879 7.0808 0.6970 3.0844 8.2082 5.8279 11.3309 26.1894 0.9777 6.5705 0.3118 14.6507 19.4878 10.8289 2.8840 10.7126 107.8443 27.3218 13.7927 7.7453 31.9038 16.3236 17.5952 15.4125 0.7317 4.5608 27.7681 2.3493 34.9972 0.0780 15.6882 27.5555 14.5938 8.2981 5.5356 25.4365 0.3469 4.6483 0.9259 10.7369 4.5637 84.6092 42.9732 21.5417 49.3823 123.1461 66.5405 28.4118 20.3905 48.6671 151.8859 0.9813 20.1194 58.1714 447.3527 82.8604 8.8996 32.7209 33.8008 82.7456 6.5508 12.7948 2.1984 3.0681 1.6793 7.0978 21.0214 17.8035 16.5623 12.8563 44.2699
temp: 298.150 k
press: 1.00000 atm
elementType: 35 17 8 7 6 6 6 6 6 6 6 6 6 6 6 6 6 6 6 1 1 1 1 1 1 1 1 1 1 1
symmnumber: 1
zpe: 574080.7 jmol-1
zpe.correction: 0.218656 hartree
zpe.thermalcorrener: 0.234776 hartree
zpe.thermalcorrenthalpy: 0.235720 hartree
zpe.thermalcorrgfe: 0.172914 hartree
zpe.sumelectzpe: -1180.415806 hartree
zpe.sumelectthermal: -1180.399686 hartree
zpe.sumelectthermalent: -1180.398742 hartree
zpe.sumelectthermalfe: -1180.461548 hartree
dipole: 0.8644 3.6757 0.6299
dipole: 3.8281
quadrupole: -96.7710 -130.6398 -129.6562
quadrupole: -1.4068 -5.3482 -1.6172
quadrupole: 22.2513 -11.6174 -10.6339 -1.4068 -5.3482 -1.6172
hfenergy: -1180.6344621 hartree
pointgroup: C01 [X(C15H11Br1Cl1N1O1)]
dipole: 0.0351877 -1.4393034 -0.4421731 debye
polarizability: 334.0930468|-5.7764358|228.5679121|3.3934363|7.5025057|96.9896994 unknown
InChI: InChI=1S/C15H11BrClNO/c1-8(19)18-14-7-12-11(6-13(14)17)9-4-2-3-5-10(9)15(12)16/h2-7,15,18H,1H3
charge 0 multiplicity 1
30 atoms
Br -1.15018 3.00922 1.269784
Cl 2.493434 -3.170056 0.317341
O  3.84572 1.953917 -0.371439
N  3.474129 -0.340107 -0.01903
C  -1.251216 1.616914 -0.264578
C  -0.166451 0.569044 -0.124668
C  -0.770974 -0.715206 0.020829
C  -2.539204 0.82347 -0.201345
C  -2.237953 -0.562952 -0.027919
C  1.222626 0.739017 -0.147061
C  0.040336 -1.859083 0.155369
C  -3.868113 1.265151 -0.303377
C  2.061594 -0.407532 -0.013274
C  -3.275223 -1.514828 0.042553
C  1.43296 -1.678856 0.137588
C  -4.910784 0.307177 -0.231899
C  -4.614968 -1.06788 -0.059541
C  4.292433 0.785869 -0.187208
C  5.784701 0.467414 -0.125913
H  -1.149183 2.271901 -1.143444
H  1.692388 1.719648 -0.24624
H  -0.381924 -2.861495 0.265357
H  -4.096656 2.330445 -0.415776
H  -3.057713 -2.581051 0.170141
H  -5.954172 0.631823 -0.306366
H  -5.434221 -1.793229 -0.004243
H  3.947884 -1.239724 0.113789
H  6.062567 0.037613 0.854222
H  6.347818 1.399345 -0.275994
H  6.074943 -0.255168 -0.910961
