program: Gaussian 09
title: 000249660
version: EM64L-G09RevD.01
frameworkgroup: C1[X(C10H20N2O)]
method: RPBEPBE
basis: SDD
operation: Freq
keyword: #p
keyword: freq=noraman
keyword: PBEPBE/SDD
title: #p freq=noraman PBEPBE/SDD
converged: YES YES NO NO
title: Mulliken charges:
elementType: O N N C C C C C C C C C C H H H H H H H H H H H H H H H H H H H H
charge: -0.248444 -0.153266 -0.110845 0.006193 -0.030081 -0.508211 -0.457406 -0.713009 -0.738154 -0.353899 -0.322866 -0.323592 -0.309344 0.203629 0.229570 0.225492 0.221806 0.209470 0.228983 0.206952 0.212558 0.221556 0.210868 0.213630 0.235933 0.222534 0.200223 0.188399 0.222971 0.212005 0.190796 0.193288 0.212261
chargesum: 0.00000
title: Mulliken charges with hydrogens summed into heavy atoms:
elementType: O N N C C C C C C C C C C
charge: -0.248444 -0.153266 -0.110845 0.209821 0.199489 -0.060913 -0.018953 -0.071943 -0.077723 0.068858 0.088504 0.079210 0.096205
polarizability: 1.38723827e+02 -6.37008436e-01 1.19090143e+02 -6.38298862e-01 6.42398386e-01 1.08912869e+02
1716.lowfreq: -13.1549 -0.0003 -0.0002 0.0005 3.7642 13.7960 24.0513 79.6912 84.6642
frequency: 21.8229 79.6911 84.6517 112.8104 152.2072 218.5115 236.7284 245.3537 253.8209 274.3628 295.9518 322.0228 360.1701 382.2931 394.1324 433.7118 457.9975 521.8587 529.0902 637.0947 650.8140 698.0499 782.9077 791.9932 822.9758 841.6992 854.3568 884.3438 898.2902 921.5540 950.8830 966.0023 1008.7268 1014.6888 1025.6197 1050.4404 1051.1654 1074.0808 1076.7821 1082.9616 1120.7272 1131.7360 1138.5026 1152.4500 1164.9847 1179.9309 1201.1048 1207.2397 1246.6590 1267.4591 1272.1650 1279.9854 1296.2784 1307.0254 1317.5603 1322.7773 1339.2144 1343.2541 1347.1164 1359.6089 1366.5959 1368.6082 1378.8508 1442.0311 1449.3951 1449.9530 1456.0545 1461.0325 1465.2293 1469.3876 1477.0153 1481.7117 1487.4975 2881.3344 2901.6515 2906.7140 2950.6368 2956.5089 2970.0916 2974.0243 2997.1920 3006.0620 3018.9355 3051.7787 3059.3644 3065.3301 3065.8746 3069.9862 3073.6712 3077.1249 3079.9854 3082.0187 3085.9474
redmass: 2.6135 2.9611 3.7167 3.1826 2.4708 3.0014 1.1973 1.4247 2.7872 1.2314 2.4710 2.8975 2.6215 1.9062 2.3648 2.7416 2.8818 3.5714 3.3137 2.5877 2.2395 2.6710 1.8942 4.0355 3.8340 1.5889 2.4382 1.8859 2.2186 1.4527 1.7290 2.6842 2.1739 1.5946 1.8861 1.4624 1.9770 1.8394 3.8470 2.2521 1.9178 2.2556 2.8660 3.1509 2.8764 1.0832 1.5851 1.5349 1.4333 1.5150 1.4013 1.2518 1.3074 1.4942 1.3830 1.3009 1.3888 1.2499 1.2766 1.3578 1.2403 1.2544 1.2232 1.0829 1.0933 1.0792 1.0792 1.0771 1.0663 1.0664 1.0469 1.0812 1.0613 1.0704 1.0706 1.0805 1.0660 1.0660 1.0352 1.0357 1.0801 1.0608 1.0681 1.0897 1.1025 1.0990 1.0917 1.0985 1.0969 1.1009 1.0980 1.1015 1.1023
irintensity: 0.0727 0.3779 0.4295 0.3424 0.6633 3.8246 0.8162 2.3659 3.2606 0.9151 5.3379 5.7038 2.7476 0.6613 0.1889 5.3609 0.6479 7.4603 11.0711 9.2498 2.5204 2.0597 2.5448 4.0078 27.6630 0.6345 8.9517 0.3742 3.3336 8.1312 0.4924 1.6009 5.2884 9.1166 5.6604 7.6602 22.5111 9.5511 52.5244 0.5664 1.7163 5.4849 12.7112 2.1574 20.2453 2.1824 15.3585 5.2517 17.9490 8.8090 2.2224 3.3197 0.6317 3.1235 0.4216 2.7984 21.5693 9.4786 2.6234 11.2795 15.2519 4.9444 17.4969 2.5335 17.5612 4.7361 4.7714 6.3100 8.9695 6.5582 9.5705 4.7979 7.6963 32.6885 75.9820 76.0885 47.6342 101.8016 26.6195 32.4737 13.4564 50.2251 45.0947 32.4206 8.4015 66.3789 22.3049 40.2860 41.1095 29.2145 40.0739 48.0016 53.3224
temp: 298.150 k
press: 1.00000 atm
elementType: 8 7 7 6 6 6 6 6 6 6 6 6 6 1 1 1 1 1 1 1 1 1 1 1 1 1 1 1 1 1 1 1 1
symmnumber: 1
zpe: 768516.9 jmol-1
zpe.correction: 0.292713 hartree
zpe.thermalcorrener: 0.306172 hartree
zpe.thermalcorrenthalpy: 0.307116 hartree
zpe.thermalcorrgfe: 0.252691 hartree
zpe.sumelectzpe: -576.657729 hartree
zpe.sumelectthermal: -576.644270 hartree
zpe.sumelectthermalent: -576.643326 hartree
zpe.sumelectthermalfe: -576.697751 hartree
dipole: 2.1254 -0.4695 -0.3048
dipole: 2.1978
quadrupole: -88.8292 -80.3204 -77.1397
quadrupole: 1.0851 -2.5040 1.3544
quadrupole: -6.7327 1.7760 4.9567 1.0851 -2.5040 1.3544
hfenergy: -576.9504419 hartree
pointgroup: C01 [X(C10H20N2O1)]
dipole: 0.8380184 -0.0472433 -0.2078242 debye
polarizability: 138.7376064|-0.0409877|113.4402666|-0.6953015|5.0977337|114.548967 unknown
InChI: InChI=1S/C10H20N2O/c1-9-3-4-10(2)12(9)11-5-7-13-8-6-11/h9-10H,3-8H2,1-2H3
charge 0 multiplicity 1
33 atoms
O  -3.505874 0.223781 -0.15899
N  0.743593 -0.192504 0.296269
N  -0.665302 -0.267196 0.031134
C  1.476631 1.11671 0.183472
C  1.561524 -1.309953 -0.266709
C  2.958793 0.681768 -0.045278
C  2.980421 -0.862581 0.152528
C  1.284823 1.99901 1.43497
C  1.419722 -1.542777 -1.792481
C  -1.212637 0.586882 -1.058174
C  -1.502845 -0.171181 1.254407
C  -2.657358 0.140189 -1.357852
C  -2.935613 -0.615281 0.911799
H  1.128092 1.696727 -0.701676
H  1.264426 -2.241561 0.251172
H  3.640194 1.193626 0.656508
H  3.282074 0.943376 -1.068971
H  3.768693 -1.353983 -0.443918
H  3.145575 -1.110096 1.216144
H  1.858761 2.940627 1.338279
H  0.222896 2.265018 1.584242
H  1.632479 1.46204 2.33586
H  1.769012 -0.670776 -2.377407
H  2.017793 -2.421018 -2.101055
H  0.36451 -1.74456 -2.049257
H  -0.596927 0.465462 -1.967102
H  -1.223218 1.669659 -0.782442
H  -1.536886 0.866041 1.664365
H  -1.065289 -0.832216 2.021854
H  -3.132129 0.803282 -2.100767
H  -2.647025 -0.904356 -1.738617
H  -2.927633 -1.67847 0.587797
H  -3.611579 -0.49229 1.774393
