program: Gaussian 09
title: 000249656
version: EM64L-G09RevD.01
frameworkgroup: C1[X(C9H10O7S)]
method: RPBEPBE
basis: SDD
operation: Freq
keyword: #p
keyword: freq=noraman
keyword: PBEPBE/SDD
title: #p freq=noraman PBEPBE/SDD
converged: YES YES NO NO
title: Mulliken charges:
elementType: S O O O O O O O C C C C C C C C C H H H H H H H H H H
charge: 1.000940 -0.214186 -0.355287 -0.267745 -0.203865 -0.511353 -0.476663 -0.231510 0.261714 0.182433 -0.321323 -0.392597 0.157965 -0.212722 -0.737696 0.307598 -0.749561 0.266650 0.268197 0.297463 0.292224 0.286611 0.302097 0.288119 0.256604 0.253940 0.251954
chargesum: 0.00000
title: Mulliken charges with hydrogens summed into heavy atoms:
elementType: S O O O O O O O C C C C C C C C C
charge: 1.000940 -0.214186 -0.355287 -0.267745 -0.203865 -0.511353 -0.476663 -0.231510 0.261714 0.182433 0.213525 -0.095135 0.157965 0.079502 0.139131 0.307598 0.012937
polarizability: 2.68973458e+02 -6.63218875e+00 1.49644178e+02 -1.40548912e+01 3.73723501e+00 1.00398482e+02
1716.lowfreq: -7.8387 -4.8781 -0.0017 -0.0014 -0.0009 3.8008 16.9065 17.5368 22.9038
frequency: 16.7981 17.4891 22.8484 31.0752 40.2371 54.8096 76.6538 104.9415 132.2456 138.7626 152.4668 154.5649 183.8359 206.7626 229.1014 239.8613 270.8520 309.9461 341.4294 358.0961 395.1676 426.4432 464.6158 481.6318 508.0773 548.5684 562.6100 566.4250 586.1068 616.0526 713.4273 752.6539 762.3749 820.9727 831.8849 853.2825 887.2412 894.3760 901.3552 971.2304 983.4757 997.3668 1015.3047 1026.0368 1044.6047 1112.0910 1142.7839 1188.6041 1190.8001 1195.9732 1228.7087 1279.5423 1312.5129 1331.5762 1372.5901 1387.5684 1412.1078 1418.8843 1452.4864 1454.6159 1457.9256 1495.3855 1578.2982 1647.4933 1670.8326 2996.0686 3009.2813 3040.6271 3050.1365 3099.4727 3145.3813 3189.6231 3197.4034 3199.4348 3213.7214
redmass: 5.9444 4.6444 4.1252 1.2395 8.5096 5.7244 5.6665 7.2893 1.9705 5.9160 2.0249 3.1765 2.6291 8.9595 7.4970 4.5587 5.3065 9.3346 11.8565 6.8688 3.9943 4.8097 5.4689 6.3395 6.7808 4.7898 3.5018 6.4681 8.0959 5.4786 6.4014 4.7696 4.6639 10.8063 6.0338 1.5997 3.7918 1.4488 3.3707 2.8201 1.2801 1.7758 3.4219 1.7584 1.6603 6.8826 3.9331 3.8224 1.0731 3.2872 1.5717 2.3588 1.1318 2.6668 1.7026 1.2774 1.0532 1.0525 1.0552 1.0521 1.0802 5.6230 11.9675 8.2838 9.0642 1.0568 1.0378 1.0245 1.1042 1.0960 1.1015 1.1081 1.0925 1.1076 1.0954
irintensity: 5.3384 1.9520 2.5998 0.2074 3.5181 2.7189 1.4027 5.0396 1.9101 7.4461 2.1112 3.8460 7.5065 12.0268 24.3323 0.4865 5.6131 26.4203 10.1463 25.4049 22.7242 0.8235 1.9570 1.2681 14.7037 1.0487 9.4756 47.0334 17.0957 2.6214 1.0408 8.3764 4.1959 49.6922 64.2699 30.4692 20.9769 21.4216 27.3305 4.1790 66.8468 1.7344 159.6639 35.5485 12.2302 43.9337 4.4012 626.7795 1.0607 36.2603 3.3758 194.9909 2.9279 12.8472 26.0125 73.3058 17.2390 10.0299 18.5896 25.5051 20.4678 88.9618 137.7404 304.2039 61.2986 11.4331 0.8461 0.6865 6.2614 5.6979 8.5313 0.1169 1.7412 0.0788 1.2447
temp: 298.150 k
press: 1.00000 atm
elementType: 16 8 8 8 8 8 8 8 6 6 6 6 6 6 6 6 6 1 1 1 1 1 1 1 1 1 1
symmnumber: 1
zpe: 479499.1 jmol-1
zpe.correction: 0.182632 hartree
zpe.thermalcorrener: 0.201848 hartree
zpe.thermalcorrenthalpy: 0.202792 hartree
zpe.thermalcorrgfe: 0.129983 hartree
zpe.sumelectzpe: -1272.098851 hartree
zpe.sumelectthermal: -1272.079635 hartree
zpe.sumelectthermalent: -1272.078690 hartree
zpe.sumelectthermalfe: -1272.151499 hartree
dipole: 0.2272 -1.7970 -2.5355
dipole: 3.1160
quadrupole: -77.3426 -119.1887 -109.1085
quadrupole: 18.4245 13.7106 3.9200
quadrupole: 24.5374 -17.3088 -7.2286 18.4245 13.7106 3.9200
hfenergy: -1272.2814821 hartree
pointgroup: C01 [X(C9H10O7S1)]
dipole: -0.088703 -0.8070121 -0.918563 debye
polarizability: 268.0085564|20.01431|103.0215163|5.0275214|-8.2872219|147.9860453 unknown
InChI: InChI=1S/C8H7O5.CH3O2S/c1-5(9)12-3-6-2-7(10)8(11)4-13-6;1-4(2)3/h2,4H,3H2,1H3;1H3
charge 0 multiplicity 1
27 atoms
S  4.071369 1.059229 -0.23085
O  -0.395141 0.136467 -1.588644
O  2.879683 -0.630835 -0.140064
O  -3.489024 0.201834 0.34745
O  1.166802 -0.710379 2.189528
O  3.582926 1.799623 -1.598601
O  4.260175 1.926511 1.126499
O  -5.357715 0.582139 -0.990975
C  -1.235439 0.039199 -0.457882
C  1.539658 -0.392392 -0.200101
C  -2.659082 0.305429 -0.866984
C  -0.743883 -0.254466 0.782228
C  0.694478 -0.475491 1.037114
C  0.962733 -0.07286 -1.424617
C  5.622714 0.00949 -0.542705
C  -4.87628 0.374374 0.141308
C  -5.613975 0.286238 1.454884
H  -2.999215 -0.426015 -1.624648
H  -2.762161 1.31299 -1.312993
H  -1.435592 -0.305639 1.625478
H  1.524538 0.049987 -2.352187
H  6.450244 0.716377 -0.693447
H  5.74414 -0.604795 0.358973
H  5.400613 -0.593984 -1.431429
H  -5.425285 1.19806 2.049568
H  -5.257404 -0.573261 2.045586
H  -6.693477 0.19827 1.266611
