program: Gaussian 09
title: 000249642
version: EM64L-G09RevD.01
frameworkgroup: C1[X(C15H15N5)]
method: RPBEPBE
basis: SDD
operation: Freq
keyword: #pfreq=noraman
keyword: PBEPBE/SDD
title: #p freq=noraman PBEPBE/SDD
converged: YES YES NO NO
title: Mulliken charges:
elementType: N N N N N C C C C C C C C C C C C C C C H H H H H H H H H H H H H H H
charge: -0.015525 -0.374553 -0.125364 -0.171535 -0.614869 0.451046 0.426028 -0.380294 -0.366789 -0.375456 -0.368172 -0.223059 -0.218355 -0.237172 -0.225623 -0.221338 -0.239640 -0.386842 -0.378474 0.283326 0.223134 0.250076 0.225288 0.248940 0.228920 0.227581 0.231140 0.225280 0.223573 0.227311 0.212574 0.229813 0.309368 0.344608 0.355053
chargesum: 0.00000
title: Mulliken charges with hydrogens summed into heavy atoms:
elementType: N N N N N C C C C C C C C C C C C C C C
charge: -0.015525 -0.065185 -0.125364 -0.171535 0.084792 0.451046 0.426028 -0.157160 -0.116713 -0.150168 -0.119233 0.005861 0.009226 -0.006033 -0.000343 0.002235 -0.012329 -0.174268 -0.148661 0.283326
polarizability: 6.44494465e+02 -8.46391308e+00 1.94681551e+02 -1.16336291e-01 -3.32231922e-03 7.58838024e+01
1716.lowfreq: -11.6438 -0.0014 -0.0010 0.0003 1.4840 3.6559 22.1736 24.4611 31.9443
frequency: 22.1680 24.4566 31.9423 52.9414 65.5197 81.2556 124.8706 146.6651 174.3183 208.6678 236.0105 251.8718 263.6351 302.8489 330.6310 343.1847 404.2930 405.5158 417.5360 421.9233 510.5658 516.9622 534.6635 541.2778 608.5192 614.1798 615.2699 621.8473 627.1884 663.5090 683.8614 686.8026 697.1652 698.4253 769.4753 770.6899 840.3961 850.3472 852.1048 857.6317 906.3571 917.5698 938.4926 961.3680 963.6825 980.7370 981.1260 986.6324 987.1039 996.6795 998.1832 1016.9772 1023.1965 1023.6512 1074.8969 1079.8068 1085.1310 1146.8718 1170.1850 1172.5409 1180.5071 1183.9600 1233.9749 1242.1563 1306.5914 1315.5846 1330.8519 1345.6317 1384.2781 1386.6216 1411.2538 1434.4580 1439.8736 1480.0261 1482.5024 1491.5812 1530.0693 1567.1046 1568.2623 1587.9143 1590.9939 1607.9660 1612.4088 1620.6574 2993.8003 3030.0825 3117.0626 3117.0741 3125.8810 3129.6073 3139.6594 3142.9247 3154.5892 3157.4356 3165.7776 3168.7750 3427.8657 3522.6392 3684.4730
redmass: 5.3755 3.8264 5.7126 4.0103 5.3315 5.1003 5.2896 6.0086 6.3237 5.6395 3.7716 2.9105 3.0580 4.9986 6.7273 6.0538 2.8267 2.8326 4.4428 4.9016 2.8625 2.9225 6.9427 1.1988 1.1979 6.3791 6.4658 6.4781 1.5966 6.6237 3.9279 2.3100 1.7306 1.7439 1.7680 1.7901 4.6465 1.2571 1.2533 3.7826 1.3799 1.3773 1.5737 1.5468 5.6096 1.3829 1.3876 6.2592 6.2448 1.3293 1.3271 4.2866 2.1453 2.3337 1.8528 1.6088 1.7091 3.8012 1.0634 1.0600 1.1116 1.1142 1.9084 2.0335 1.5767 1.4602 1.2975 1.7735 5.4478 6.7825 2.3038 2.3418 2.3286 2.2597 2.4104 1.5207 3.6221 6.3122 4.5191 5.1595 5.8936 5.5996 6.1045 4.1901 1.0873 1.0877 1.0870 1.0870 1.0869 1.0865 1.0922 1.0919 1.0956 1.0956 1.1005 1.1007 1.0757 1.0423 1.1060
irintensity: 0.2418 0.1157 0.0543 0.4232 0.3907 1.4883 0.1752 1.0851 1.7658 0.9004 6.3730 0.0176 17.4476 0.0351 14.5436 4.7898 0.0012 0.0012 10.9410 2.1074 1.1557 51.0283 0.3079 220.3355 21.8450 0.9549 0.0414 48.6847 39.3236 5.9762 3.1907 53.3444 32.3574 121.8017 19.7829 73.8378 5.5425 0.6761 0.2706 0.3133 9.4949 0.0055 33.5444 33.2461 111.2019 0.1155 0.8891 2.8818 0.1398 2.0198 0.9815 157.9623 10.9191 5.2880 90.8459 19.8794 34.2857 93.4296 0.1400 0.8898 0.1922 0.0839 3.2244 19.9145 41.0556 1.2788 40.7979 55.5049 60.5574 0.9073 239.8198 9.6662 3.0066 8.0154 69.6449 140.3036 546.7738 312.5565 99.9806 45.2573 131.9436 190.4277 3.6129 494.0649 49.5921 27.7966 8.1476 12.3863 0.2451 0.7870 25.9218 21.2206 40.8564 36.0641 36.9580 29.3955 11.8572 30.0791 105.0020
temp: 298.150 k
press: 1.00000 atm
elementType: 7 7 7 7 7 6 6 6 6 6 6 6 6 6 6 6 6 6 6 6 1 1 1 1 1 1 1 1 1 1 1 1 1 1 1
symmnumber: 1
zpe: 721917.6 jmol-1
zpe.correction: 0.274964 hartree
zpe.thermalcorrener: 0.292657 hartree
zpe.thermalcorrenthalpy: 0.293601 hartree
zpe.thermalcorrgfe: 0.226653 hartree
zpe.sumelectzpe: -852.898828 hartree
zpe.sumelectthermal: -852.881135 hartree
zpe.sumelectthermalent: -852.880191 hartree
zpe.sumelectthermalfe: -852.947140 hartree
dipole: -2.6372 0.1273 -0.0021
dipole: 2.6402
quadrupole: -94.1924 -98.8890 -126.7880
quadrupole: 3.3835 -0.0320 -0.0076
quadrupole: 12.4307 7.7342 -20.1649 3.3835 -0.0320 -0.0076
hfenergy: -853.1737923 hartree
pointgroup: C01 [X(C15H15N5)]
dipole: -1.0311144 -0.0157162 0.1246737 debye
polarizability: 640.6556991|12.0715333|77.4750541|-41.1637021|11.6654518|196.9290644 unknown
InChI: InChI=1S/C15H15N5/c16-15(19-17-11-13-7-3-1-4-8-13)20-18-12-14-9-5-2-6-10-14/h1-12,19H,16H2
charge 0 multiplicity 1
35 atoms
N  -2.33484 -0.10143 -0.146615
N  -1.199078 -0.15076 -0.91414
N  2.320975 -0.00032 -0.454397
N  1.099424 -0.110127 -1.160131
N  0.105999 0.097987 1.040252
C  -4.768165 -0.158749 -0.011356
C  4.749903 0.044873 -0.697291
C  -5.991323 -0.275429 -0.730756
C  -4.81794 -0.004128 1.405104
C  5.850159 -0.01496 -1.599842
C  5.017368 0.194714 0.695596
C  -7.230006 -0.239247 -0.056601
C  -6.055791 0.031629 2.074067
C  -7.268507 -0.085528 1.348608
C  7.17717 0.072006 -1.128298
C  6.342267 0.281162 1.163274
C  7.43001 0.220456 0.255377
C  -3.504711 -0.201496 -0.752716
C  3.387551 -0.049495 -1.231459
C  0.056896 -0.04979 -0.314968
H  -5.96689 -0.394586 -1.821498
H  -3.878434 0.085958 1.959474
H  5.656703 -0.130085 -2.6739
H  4.171115 0.240559 1.388598
H  -8.162603 -0.330447 -0.624249
H  -6.082498 0.150887 3.163097
H  -8.229421 -0.056959 1.87394
H  8.012308 0.024282 -1.836234
H  6.53527 0.396168 2.236177
H  8.45984 0.288021 0.623627
H  -3.575087 -0.32225 -1.851447
H  3.268585 -0.165705 -2.323437
H  -1.202084 -0.260915 -1.937732
H  -0.755593 0.130396 1.579675
H  1.03913 0.168209 1.444402
