program: Gaussian 09
title: 000249591
version: EM64L-G09RevD.01
frameworkgroup: C1[X(C7H16N2OS)]
method: RPBEPBE
basis: SDD
operation: Freq
keyword: #p
keyword: freq=noraman
keyword: PBEPBE/SDD
title: #p freq=noraman PBEPBE/SDD
converged: YES YES NO NO
title: Mulliken charges:
elementType: S O N N C C C C C C C H H H H H H H H H H H H H H H H
charge: 0.007747 -0.459334 -0.309659 -0.235181 0.306124 -0.430822 0.217888 -0.588071 -0.720776 -0.742524 -0.744841 0.216815 0.205036 0.269038 0.281839 0.270648 0.212035 0.265164 0.196057 0.231234 0.211930 0.207248 0.230956 0.238670 0.208081 0.345921 0.108777
chargesum: 0.00000
title: Mulliken charges with hydrogens summed into heavy atoms:
elementType: S O N N C C C C C C C
charge: 0.116524 -0.113413 -0.040620 0.035467 0.306124 -0.008971 0.217888 -0.306232 -0.047521 -0.092112 -0.067134
polarizability: 1.24018453e+02 -1.94792446e+00 1.07380849e+02 -1.07155959e+00 -5.59742469e-01 9.64078876e+01
1716.lowfreq: -13.7323 -8.2361 -0.0011 -0.0009 0.0025 5.3177 81.4535 108.5512 147.1936
frequency: 81.4286 108.5228 147.1896 188.2193 200.8317 215.0902 227.4309 239.0032 265.2678 281.2164 298.7480 320.5795 321.8137 366.8248 416.1062 427.0108 437.6932 469.6993 478.2659 533.1034 548.3339 652.4194 670.4604 729.9339 785.2299 810.1618 841.3912 877.7792 916.3595 928.0073 936.2252 948.0089 975.9178 999.7419 1031.0945 1058.7623 1097.9331 1115.7390 1131.0721 1191.5923 1203.8009 1244.1604 1262.8634 1277.3018 1297.8541 1317.4284 1347.1090 1374.6464 1382.3440 1388.6373 1412.7624 1426.7081 1436.8892 1455.7834 1463.7691 1465.7664 1470.6637 1478.9614 1492.9015 2408.2972 2966.1736 2971.9223 2975.7758 2982.6355 2998.2324 3059.5876 3065.1083 3069.1061 3078.2310 3089.2131 3100.1497 3102.2407 3410.0175 3460.1143 3527.9145
redmass: 4.3814 3.1379 3.0395 3.4801 1.1058 1.0637 1.1852 1.3569 2.2132 1.9613 3.3351 2.7640 2.9101 1.4767 2.2441 2.1309 2.2013 2.9517 1.7856 2.6633 2.4733 2.3597 1.8703 5.3641 4.3043 2.4827 1.6521 2.0896 1.8888 1.6545 1.8643 1.6282 1.6538 1.3898 3.0354 1.9603 2.1268 1.9390 2.9920 2.3218 2.3434 2.7368 1.5430 1.4703 1.3945 1.3299 1.7983 1.2094 1.2373 1.2392 1.2877 1.1908 1.0965 1.0550 1.0637 1.0582 1.0694 1.0583 1.0688 1.0372 1.0811 1.0381 1.0377 1.0370 1.0602 1.0998 1.1001 1.0979 1.0990 1.1000 1.0982 1.0993 1.0740 1.0751 1.0645
irintensity: 2.0757 3.9611 2.7745 0.4323 0.3732 0.4079 11.0526 4.5324 3.5846 13.0389 3.4749 3.8115 2.7501 72.3057 10.5013 21.3126 20.8502 21.8005 89.2259 42.5745 34.6419 57.7915 95.5564 2.2377 9.1638 17.0976 4.3493 19.8927 10.6946 2.7523 9.1955 3.7928 7.5237 4.7721 31.9956 54.0444 34.9171 5.5681 53.5441 42.9200 51.3417 88.8148 6.2117 17.7760 18.1427 21.9629 42.5307 28.2034 35.4707 35.4300 12.6569 57.4468 0.3410 1.3496 6.2417 17.2309 4.8327 2.0672 16.7646 15.7277 21.6957 25.6131 53.1631 15.4857 28.4997 1.5168 10.8256 68.5639 31.2916 35.8161 13.8392 20.8016 1.5901 2.9028 3.3912
temp: 298.150 k
press: 1.00000 atm
elementType: 16 8 7 7 6 6 6 6 6 6 6 1 1 1 1 1 1 1 1 1 1 1 1 1 1 1 1
symmnumber: 1
zpe: 596549.4 jmol-1
zpe.correction: 0.227214 hartree
zpe.thermalcorrener: 0.240303 hartree
zpe.thermalcorrenthalpy: 0.241247 hartree
zpe.thermalcorrgfe: 0.189522 hartree
zpe.sumelectzpe: -858.203747 hartree
zpe.sumelectthermal: -858.190658 hartree
zpe.sumelectthermalent: -858.189714 hartree
zpe.sumelectthermalfe: -858.241439 hartree
dipole: -1.2598 0.3213 -1.5453
dipole: 2.0195
quadrupole: -82.9187 -71.9369 -74.7703
quadrupole: 1.3163 0.1125 1.5580
quadrupole: -6.3767 4.6051 1.7717 1.3163 0.1125 1.5580
hfenergy: -858.430961 hartree
pointgroup: C01 [X(C7H16N2O1S1)]
dipole: -0.1521037 0.4543107 0.6338311 debye
polarizability: 107.4652344|-2.1430655|123.9907304|-0.3460894|0.6143078|96.3512242 unknown
InChI: InChI=1S/C7H16N2OS/c1-6(2)4-7(3,10)9-5(11)8-6/h5,8-11H,4H2,1-3H3
charge 0 multiplicity 1
27 atoms
S  0.024565 -3.335715 -0.310533
O  1.455039 1.058022 -1.345611
N  -1.187085 -0.913826 0.129656
N  1.243403 -0.862372 0.060713
C  -1.361186 0.578964 -0.008928
C  -0.068761 1.256799 0.533648
C  1.264684 0.621783 0.056806
C  0.028148 -1.451595 -0.51471
C  -1.65773 1.006158 -1.476591
C  -2.557343 0.971033 0.888775
C  2.452003 1.096233 0.915404
H  -0.072304 2.326496 0.256424
H  -0.084506 1.191894 1.638328
H  -2.032055 -1.411176 -0.192313
H  0.059298 -1.30514 -1.614369
H  1.466324 -1.260746 0.982105
H  -1.862097 2.091795 -1.527485
H  -0.797775 0.806051 -2.13595
H  -2.55009 0.473586 -1.858513
H  -2.396913 0.61735 1.922296
H  -2.690565 2.068241 0.902486
H  -3.496691 0.522896 0.510919
H  3.39304 0.653317 0.54222
H  2.533467 2.194406 0.856207
H  2.328935 0.812352 1.977289
H  2.203342 0.511392 -1.704129
H  -0.431045 -3.275901 1.000454
