program: Gaussian 09
title: 000249586
version: EM64L-G09RevD.01
frameworkgroup: C1[X(C20H12Cl3NS)]
method: RPBEPBE
basis: SDD
operation: Freq
keyword: #p
keyword: freq=noraman
keyword: PBEPBE/SDD
title: #p freq=noraman PBEPBE/SDD
converged: YES YES NO NO
title: Mulliken charges:
elementType: Cl Cl Cl S N C C C C C C C C C C C C C C C C C C C C H H H H H H H H H H H H
charge: -0.037937 -0.036958 -0.035927 0.262076 0.003522 -0.475328 0.460497 0.422917 0.393355 -0.319304 -0.362810 -0.368626 -0.374885 -0.339863 -0.317237 -0.239031 -0.214539 -0.218912 -0.221540 -0.218178 -0.234112 -0.124827 -0.125724 -0.124519 -0.365341 0.280712 0.266512 0.268593 0.265637 0.281131 0.275774 0.265917 0.260408 0.261722 0.260723 0.262420 0.263680
chargesum: 0.00000
title: Mulliken charges with hydrogens summed into heavy atoms:
elementType: Cl Cl Cl S N C C C C C C C C C C C C C C C C C C C C
charge: -0.037937 -0.036958 -0.035927 0.262076 0.003522 -0.475328 0.460497 0.422917 0.393355 -0.038592 -0.096298 -0.100033 -0.109248 -0.058732 -0.041462 0.026886 0.045869 0.042810 0.039183 0.044242 0.029568 -0.124827 -0.125724 -0.124519 -0.365341
polarizability: 3.28540657e+02 -1.91208432e+00 3.05494739e+02 1.31265810e+01 -2.57018821e+00 2.09658973e+02
1716.lowfreq: -6.6723 -3.5892 0.0003 0.0016 0.0020 3.4030 18.7984 25.0882 33.3614
frequency: 18.6101 25.0095 33.3445 40.0048 42.2918 50.7220 78.3708 85.7769 117.5661 121.4164 138.7250 158.7815 164.4214 189.3799 213.4482 216.4330 218.1614 273.3397 312.7679 315.0191 326.1784 343.2261 345.0046 383.3251 404.2381 406.2175 414.1383 416.1173 432.0788 443.3169 451.3221 501.3126 521.4797 521.8691 612.9910 623.3699 624.3419 633.8953 654.7743 677.3553 681.1294 721.5257 721.7528 726.1932 749.4408 826.1527 827.2353 834.4168 836.5507 838.6884 844.7259 895.1962 903.5019 959.8120 961.9683 962.9414 975.5343 977.6668 981.3895 998.9560 999.5756 999.7634 1076.7173 1078.1667 1079.0100 1118.1784 1118.5275 1121.6571 1141.5691 1194.2117 1195.8439 1199.8080 1223.7842 1228.1146 1297.9203 1301.5052 1304.1590 1350.0971 1365.4176 1366.0890 1393.9138 1397.5736 1398.1516 1473.1803 1474.8904 1477.2011 1572.2129 1577.4732 1577.6114 1592.8499 1593.1726 1594.9709 2075.4063 3136.0276 3143.7890 3156.3541 3158.0132 3158.1951 3159.6206 3172.6026 3172.9298 3175.0843 3178.0856 3178.5129 3178.8787
redmass: 6.6926 7.7806 12.7340 8.3259 6.9085 7.8120 5.8459 5.8807 10.6537 10.2084 8.1500 10.6372 11.2204 10.9601 11.5107 10.1568 14.6359 7.6276 6.8774 6.9163 5.1840 5.3910 5.2468 12.1186 3.2214 2.9781 3.2858 5.8732 7.0715 7.8256 6.2300 4.6450 3.2694 3.2421 5.9995 7.1174 7.1223 11.2244 6.0271 6.9430 7.0471 4.2134 4.2320 5.3405 3.7279 1.4482 1.4046 1.3460 1.3517 1.2469 1.7270 4.8337 4.8582 1.3455 1.3688 1.3515 1.3566 1.3641 1.3553 4.1101 4.0617 4.3072 3.2079 2.7318 2.7789 1.3853 1.3777 1.3894 3.2176 1.1277 1.1265 1.1324 4.1849 4.2417 1.2622 1.2694 1.2764 4.8452 6.2630 6.4424 3.8107 3.4425 3.3414 2.2621 2.2832 2.2571 7.1785 7.5261 7.5459 6.0298 6.1405 6.2412 12.7493 1.0900 1.0895 1.0890 1.0882 1.0884 1.0885 1.0954 1.0958 1.0961 1.0971 1.0971 1.0972
irintensity: 0.2937 0.0828 0.4114 0.3467 0.5594 1.6990 1.1923 2.5762 0.4081 2.0670 0.2536 1.5922 1.5525 4.6183 3.0097 0.8187 5.7021 10.0753 2.2035 2.5838 0.2676 1.0346 1.4388 0.8478 0.0997 0.3277 0.8113 1.7294 16.6912 16.0434 1.9771 10.5909 27.5553 21.9551 44.7857 0.0188 0.1149 11.1223 39.3454 11.6517 12.3003 1.1255 0.9076 0.0649 94.3750 49.2105 39.0402 19.8674 23.2844 1.2998 22.9305 17.3966 12.2295 1.7252 1.2023 1.4252 0.3626 0.6127 0.5119 47.8320 67.8542 23.1229 18.6905 78.8001 77.2599 3.4279 3.2964 2.4343 2.0681 6.6014 3.9603 1.6332 35.9036 37.6969 2.9187 0.7844 0.5315 6.2922 5.7579 4.4818 10.5061 14.0706 11.7187 26.2093 94.7529 91.9347 5.6000 8.1393 13.6122 59.0913 52.1246 12.8063 26.4036 5.5717 1.8076 1.2773 1.8047 0.8446 0.8974 1.8268 2.4030 3.0539 0.9388 1.2744 2.6635
temp: 298.150 k
press: 1.00000 atm
elementType: 17 17 17 16 7 6 6 6 6 6 6 6 6 6 6 6 6 6 6 6 6 6 6 6 6 1 1 1 1 1 1 1 1 1 1 1 1
symmnumber: 1
zpe: 668124.8 jmol-1
zpe.correction: 0.254475 hartree
zpe.thermalcorrener: 0.277526 hartree
zpe.thermalcorrenthalpy: 0.278470 hartree
zpe.thermalcorrgfe: 0.198530 hartree
zpe.sumelectzpe: -2600.578352 hartree
zpe.sumelectthermal: -2600.555302 hartree
zpe.sumelectthermalent: -2600.554358 hartree
zpe.sumelectthermalfe: -2600.634297 hartree
dipole: -2.8147 0.0964 -2.7136
dipole: 3.9109
quadrupole: -186.1303 -176.9166 -181.3864
quadrupole: 0.3886 -10.0126 0.5791
quadrupole: -4.6526 4.5612 0.0914 0.3886 -10.0126 0.5791
hfenergy: -2600.8328275 hartree
pointgroup: C01 [X(C20H12Cl3N1S1)]
dipole: 1.0521311 -0.6109092 -0.9419807 debye
polarizability: 322.640222|-11.4213157|312.8296116|1.0214596|2.0623282|208.2245355 unknown
InChI: InChI=1S/C20H12Cl3NS/c21-17-7-1-14(2-8-17)20(25-13-24,15-3-9-18(22)10-4-15)16-5-11-19(23)12-6-16/h1-12H
charge 0 multiplicity 1
37 atoms
Cl -3.88172 -4.415861 -1.38399
Cl -1.155587 5.532723 -1.904081
Cl 6.002587 -1.641548 -0.10623
S  -0.047098 0.085881 2.555712
N  -2.508465 1.602466 3.054149
C  0.065023 -0.035726 0.460888
C  -0.898174 -1.143036 0.031683
C  -0.287297 1.34535 -0.087094
C  1.54429 -0.406882 0.323325
C  -2.283737 -1.056498 0.345026
C  -1.128321 1.48537 -1.221256
C  2.421931 0.324729 -0.515945
C  -0.456134 -2.24435 -0.74666
C  0.288485 2.519176 0.4729
C  2.060816 -1.535833 1.019975
C  -3.192644 -2.04617 -0.074548
C  -1.394504 2.755077 -1.781458
C  3.777633 -0.048584 -0.655863
C  -1.357204 -3.241268 -1.185383
C  0.029206 3.792155 -0.069165
C  3.412536 -1.91334 0.902042
C  -2.714349 -3.132124 -0.836577
C  -0.812586 3.892763 -1.195866
C  4.256166 -1.160568 0.059897
C  -1.508638 0.978254 2.819007
H  -2.664098 -0.213852 0.930029
H  -1.577062 0.603173 -1.685926
H  2.053711 1.18866 -1.075619
H  0.595925 -2.332013 -1.030681
H  0.932653 2.43644 1.354593
H  1.401126 -2.127625 1.664899
H  -4.251942 -1.973487 0.186951
H  -2.044078 2.85076 -2.655945
H  4.444571 0.518786 -1.310995
H  -1.003706 -4.082477 -1.788318
H  0.464556 4.688866 0.380412
H  3.801427 -2.775089 1.451512
